{"text_format":"1","workbook":"xlsx","n_sheets":14,"sheets":["Income Table","Disclosures","T10S","T10J","T15S","T15J","Phoenix","AltiSure","TVA","PIATodaySingle","PIATomorrowSingle","PIATodayJoint","PIATomorrowJoint","PIA"],"not_rendered":{"charts":0,"images":0,"macros":1,"external_links":0,"defined_names":31,"comments":0,"pivot_tables":0},"unopened":[],"bounds":{"document_bytes":16777216,"sheet_cells":100000,"rows_first":2000,"rows_last":500,"rows_between":2000,"halvings":0,"cell_chars":16384,"cell_head_chars":4096},"cells_cut":0,"cells_raw":0,"read":"whole","date_system":"1900"}

{"sheet":"Income Table","index":0,"n_rows":62,"n_cols":79,"rows_kept":62,"cut":false,"hidden":false,"merged":[[1,1,1,3],[61,0,71,78],[1,8,1,12],[0,8,0,12],[0,0,0,3],[0,77,0,78],[1,77,1,78],[0,73,0,74],[0,75,0,76],[1,73,1,74],[1,75,1,76],[1,20,1,71],[0,20,0,71],[2,13,2,72]]}
["Income Rider Payouts",null,null,null,null,null,null,null,"State:",null,null,null,null,null,null,null,null,null,null,null,"Assumed Rate:",null,null,null,null,null,null,null,null,null,null,null,null,null,null,null,null,null,null,null,null,null,null,null,null,null,null,null,null,null,null,null,null,null,null,null,null,null,null,null,null,null,null,null,null,null,null,null,null,null,null,null,null,"Premium:",null,"Years Deferred:",null,"Age:"]
["updated:",41841,null,null,null,null,null,null,"Kansas",null,null,null,null,null,null,null,null,null,null,null,0,null,null,null,null,null,null,null,null,null,null,null,null,null,null,null,null,null,null,null,null,null,null,null,null,null,null,null,null,null,null,null,null,null,null,null,null,null,null,null,null,null,null,null,null,null,null,null,null,null,null,null,null,100000,null,10,null,55]
[null,null,null,null,null,null,null,null,null,null,null,null,null,{"$f":"IF(ror=0,\"\",\"Some of these incomes are NOT guaranteed.\")","v":""},null,null,null,null,null,null,null,null,null,null,null,null,null,null,null,null,null,null,null,null,null,null,null,null,null,null,null,null,null,null,null,null,null,null,null,null,null,null,null,null,null,null,null,null,null,null,null,null,null,null,null,null,null,null,null,null,null,null,null,null,null,null,null," "]
[]
["Company","A.M.\nBest","S&P","Rider Name","Bonus*","Annual Benefit Base Increase Rate","Rollup2","Rollup Switch","Increase Type","Rollup Bonus?","Fee Taken","Rider Fee","Max Years for Increase","Min Income Age","Max Payout","Joint Reduction","Min Issue Age","Required Deferral","Min Prem","Max Prem","Max Issue","Alabama","Alaska","Arizona","Arkansas","California","Colorado","Connecticut","Delaware","Florida","Georgia","Hawaii","Idaho","Illinois","Indiana","Iowa","Kansas","Kentucky","Louisiana","Maine","Maryland","Massachusetts","Michigan","Minnesota","Mississippi","Missouri","Montana","Nebraska","Nevada","New Hampshire","New Jersey","New Mexico","New York","North Carolina","North Dakota","Ohio","Oklahoma","Oregon","Pennsylvania","Rhode Island","South Carolina","South Dakota","Tennessee","Texas","Utah","Vermont","Virginia","Washington","West Virginia","Wisconsin","Wyoming","Attained Age","Benefit Base","Single Income Percentage","Single Annual Income","Joint Income Percentage","Joint Annual Income","Death Benefit Type","Death Benefit"]
["Allianz","A","AA","Simple Income",0.05,0.08,null,null,"Simple",0,null,9.4999999999999998E-3,{"$f":"MAX(90-Age,0)","v":35},50,0.06,5.0000000000000001E-3,0,0,20000,1000000,80,0.05,0.05,0.05,0.05,0.05,0.05,"X",0.05,0.05,0.05,0.05,0.05,0.05,0.05,0.05,0.05,0.05,0.05,0.05,0.05,0.05,0.05,0.05,0.05,0.05,0.05,0.05,0.05,0.05,0.05,0.05,"X",0.05,0.05,0.05,0.05,0.05,0.05,0.05,0.05,0.05,0.05,0.05,0.05,0.05,0.05,0.05,0.05,0.05,0.05,{"$f":"Age+Defer","v":65},{"$f":"IF(Table[[#This Row],[Bonus*]]=\"X\",\"n/a\",Premium*(1+Table[[#This Row],[Bonus*]])*IF(Table[[#This Row],[Increase Type]]=\"Simple\",1,(1+Table[[#This Row],[Annual Benefit Base Increase Rate]])^MIN(TRUNC(Defer,0),Table[[#This Row],[Max Years for Increase]]))+IF(Table[[#This Row],[Increase Type]]=\"Simple\",Table[[#This Row],[Annual Benefit Base Increase Rate]]*Premium*(1+Table[[#This Row],[Rollup Bonus?]]*Table[[#This Row],[Bonus*]])*MIN(TRUNC(Defer,0),Table[[#This Row],[Max Years for Increase]]),0))","v":185000},{"$f":"IF(Table[[#This Row],[Attained Age]]<Table[[#This Row],[Min Income Age]],0,MIN(FLOOR(Table[[#This Row],[Attained Age]]+40,10)/2000,Table[[#This Row],[Max Payout]]))","v":0.05},{"$f":"IF(OR(Defer<Table[[#This Row],[Required Deferral]],Table[[#This Row],[Bonus*]]=\"X\"),0,Table[[#This Row],[Benefit Base]]*Table[[#This Row],[Single Income Percentage]])","v":9250},{"$f":"IF(Table[[#This Row],[Single Income Percentage]]=0,0,Table[[#This Row],[Single Income Percentage]]-Table[[#This Row],[Joint Reduction]])","v":4.5000000000000005E-2},{"$f":"IF(Table[[#This Row],[Single Annual Income]]=0,0,Table[[#This Row],[Benefit Base]]*Table[[#This Row],[Joint Income Percentage]])","v":8325.0000000000018},"AV",0]
["Allianz","A","AA",360,{"$f":"IF(OR(Age<Table[[#This Row],[Min Issue Age]],Age>Table[[#This Row],[Max Issue]]),\"X\",HLOOKUP(State,States,ROW(Table[#This Row])-4,FALSE))","v":0},{"$f":"ror*1.25","v":0},null,null,null,1,"AV",1.0500000000000001E-2,"none",50,1,5.0000000000000001E-3,0,0,20000,1000000,80,0,0,0,0,0,0,0,0,0,0,0,0,0,0,0,0,0,0,0,0,0,0,0,0,0,0,0,0,0,0,0,"X",0,0,0,0,0,0,0,0,0,0,0,0,0,0,0,0,0,0,65,{"$f":"IF(Table[[#This Row],[Bonus*]]=\"X\",\"n/a\",Premium*(1+Table[[#This Row],[Bonus*]])*MAX(((1+Table[[#This Row],[Annual Benefit Base Increase Rate]])*(1-Table[[#This Row],[Rider Fee]]))^Defer,1))","v":100000},{"$f":"IF(Table[[#This Row],[Attained Age]]<Table[[#This Row],[Min Income Age]],0,MIN(MAX((Age-10)/1000,0.04),Table[[#This Row],[Max Payout]])+Defer*MAX((Age-20)/10000,0.003))","v":0.08},{"$f":"IF(OR(Defer<Table[[#This Row],[Required Deferral]],Table[[#This Row],[Bonus*]]=\"X\"),0,Table[[#This Row],[Benefit Base]]*Table[[#This Row],[Single Income Percentage]])","v":8000},{"$f":"IF(Table[[#This Row],[Single Income Percentage]]=0,0,Table[[#This Row],[Single Income Percentage]]-Table[[#This Row],[Joint Reduction]])","v":7.4999999999999997E-2},{"$f":"IF(Table[[#This Row],[Single Annual Income]]=0,0,Table[[#This Row],[Benefit Base]]*Table[[#This Row],[Joint Income Percentage]])","v":7500},"AV",0]
["Allianz","A","AA","Endurance",{"$f":"IF(OR(Age<Table[[#This Row],[Min Issue Age]],Age>Table[[#This Row],[Max Issue]]),\"X\",HLOOKUP(State,States,ROW(Table[#This Row])-4,FALSE))","v":0.2},{"$f":"ror*1.05","v":0},null,null,null,1,null,0,"none",60,0.06,5.0000000000000001E-3,0,10,10000,1000000,80,0.2,0.2,0.2,0.2,0.2,0.2,0.2,0.2,0.2,0.2,0.2,0.2,0.2,0.2,0.2,0.2,0.2,0.2,0.2,0.2,0.2,0.2,0.2,0.2,0.2,0.2,0.2,0.2,0.2,0.2,0.2,"X",0.2,0.2,0.2,0.2,0.2,0.2,0.2,0.2,0.2,0.2,0.2,0.2,0.2,0.2,"X",0.2,0.2,0.2,65,{"$f":"IF(Table[[#This Row],[Bonus*]]=\"X\",\"n/a\",Premium*(1+Table[[#This Row],[Bonus*]])*IF(Table[[#This Row],[Increase Type]]=\"Simple\",1,(1+Table[[#This Row],[Annual Benefit Base Increase Rate]])^MIN(TRUNC(Defer,0),Table[[#This Row],[Max Years for Increase]]))+IF(Table[[#This Row],[Increase Type]]=\"Simple\",Table[[#This Row],[Annual Benefit Base Increase Rate]]*Premium*(1+Table[[#This Row],[Rollup Bonus?]]*Table[[#This Row],[Bonus*]])*MIN(TRUNC(Defer,0),Table[[#This Row],[Max Years for Increase]]),0))","v":120000},{"$f":"IF(Table[[#This Row],[Attained Age]]<Table[[#This Row],[Min Income Age]],0,MIN(FLOOR(Table[[#This Row],[Attained Age]]+40,10)/2000,Table[[#This Row],[Max Payout]]))","v":0.05},{"$f":"IF(OR(Defer<Table[[#This Row],[Required Deferral]],Table[[#This Row],[Bonus*]]=\"X\"),0,Table[[#This Row],[Benefit Base]]*Table[[#This Row],[Single Income Percentage]])","v":6000},{"$f":"IF(Table[[#This Row],[Single Income Percentage]]=0,0,Table[[#This Row],[Single Income Percentage]]-Table[[#This Row],[Joint Reduction]])","v":4.5000000000000005E-2},{"$f":"IF(Table[[#This Row],[Single Annual Income]]=0,0,Table[[#This Row],[Benefit Base]]*Table[[#This Row],[Joint Income Percentage]])","v":5400.0000000000009},"IAV 5-yr",{"$f":"IF(Table[[#This Row],[Benefit Base]]=\"n/a\",0,Table[[#This Row],[Benefit Base]])","v":120000}]
["Allianz","A","AA","Income Plus Benefit",{"$f":"IF(OR(Age<Table[[#This Row],[Min Issue Age]],Age>Table[[#This Row],[Max Issue]]),\"X\",HLOOKUP(State,States,ROW(Table[#This Row])-4,FALSE))","v":0.03},2.5000000000000001E-2,null,null,null,1,null,7.4999999999999997E-3,10,60,5.5E-2,5.0000000000000001E-3,0,0,15000,1000000,80,0.02,0.03,0.03,0.03,0.03,0.03,0.02,0.02,0.02,0.03,0.03,0.03,0.03,0.02,0.02,0.03,0.02,0.03,0.03,0.03,0.03,0.03,0.02,0.02,0.03,0.03,0.03,0.03,0.03,0.02,0.03,"X",0.03,0.03,0.05,0.03,"X",0.02,0.03,0.03,0.03,0.03,0.03,0.02,0.03,0.03,"X",0.03,0.03,0.03,65,{"$f":"IF(Table[[#This Row],[Bonus*]]=\"X\",\"n/a\",Premium*(1+Table[[#This Row],[Bonus*]])*IF(Table[[#This Row],[Increase Type]]=\"Simple\",1,(1+Table[[#This Row],[Annual Benefit Base Increase Rate]])^MIN(TRUNC(Defer,0),Table[[#This Row],[Max Years for Increase]]))+IF(Table[[#This Row],[Increase Type]]=\"Simple\",Table[[#This Row],[Annual Benefit Base Increase Rate]]*Premium*(1+Table[[#This Row],[Rollup Bonus?]]*Table[[#This Row],[Bonus*]])*MIN(TRUNC(Defer,0),Table[[#This Row],[Max Years for Increase]]),0))","v":131848.70805222477},{"$f":"IF(Table[[#This Row],[Attained Age]]<Table[[#This Row],[Min Income Age]],0,MIN(FLOOR(Table[[#This Row],[Attained Age]]+30,10)/2000,Table[[#This Row],[Max Payout]]))","v":4.4999999999999998E-2},{"$f":"IF(OR(Defer<Table[[#This Row],[Required Deferral]],Table[[#This Row],[Bonus*]]=\"X\"),0,Table[[#This Row],[Benefit Base]]*Table[[#This Row],[Single Income Percentage]])","v":5933.1918623501142},{"$f":"IF(Table[[#This Row],[Single Income Percentage]]=0,0,Table[[#This Row],[Single Income Percentage]]-Table[[#This Row],[Joint Reduction]])","v":0.04},{"$f":"IF(Table[[#This Row],[Single Annual Income]]=0,0,Table[[#This Row],[Benefit Base]]*Table[[#This Row],[Joint Income Percentage]])","v":5273.9483220889906},"AV",0]
["Allianz","A","AA",222,{"$f":"IF(OR(Age<Table[[#This Row],[Min Issue Age]],Age>Table[[#This Row],[Max Issue]]),\"X\",HLOOKUP(State,States,ROW(Table[#This Row])-4,FALSE))","v":0.15},{"$f":"ror*1.5","v":0},null,null,null,1,null,0,"none",60,0.06,5.0000000000000001E-3,0,10,20000,1000000,80,0.15,0.15,0.15,0.15,0.15,0.15,0.15,0.15,0.15,0.15,0.15,0.15,0.15,0.15,0.15,0.15,0.15,0.15,0.15,0.15,0.15,0.15,0.15,0.15,0.15,0.15,0.15,0.15,0.15,0.15,0.15,"X",0.15,0.15,0.15,0.15,0.15,0.15,0.15,0.15,0.15,0.15,0.15,0.15,0.15,0.15,0.15,0.15,0.15,0.15,65,{"$f":"IF(Table[[#This Row],[Bonus*]]=\"X\",\"n/a\",Premium*(1+Table[[#This Row],[Bonus*]])*((1+Table[[#This Row],[Annual Benefit Base Increase Rate]])*(1-Table[[#This Row],[Rider Fee]]))^Defer)","v":114999.99999999999},{"$f":"IF(Table[[#This Row],[Attained Age]]<Table[[#This Row],[Min Income Age]],0,MIN(FLOOR(Table[[#This Row],[Attained Age]]+40,10)/2000,Table[[#This Row],[Max Payout]]))","v":0.05},{"$f":"IF(OR(Defer<Table[[#This Row],[Required Deferral]],Table[[#This Row],[Bonus*]]=\"X\"),0,Table[[#This Row],[Benefit Base]]*Table[[#This Row],[Single Income Percentage]])","v":5750},{"$f":"IF(Table[[#This Row],[Single Income Percentage]]=0,0,Table[[#This Row],[Single Income Percentage]]-Table[[#This Row],[Joint Reduction]])","v":4.5000000000000005E-2},{"$f":"IF(Table[[#This Row],[Single Annual Income]]=0,0,Table[[#This Row],[Benefit Base]]*Table[[#This Row],[Joint Income Percentage]])","v":5175},"IAV",{"$f":"IF(Table[[#This Row],[Benefit Base]]=\"n/a\",0,Table[[#This Row],[Benefit Base]])","v":114999.99999999999}]
["AltiSure","B+","BB+","Next Generation Bonus",{"$f":"IF(OR(Age<Table[[#This Row],[Min Issue Age]],Age>Table[[#This Row],[Max Issue]]),\"X\",HLOOKUP(State,States,ROW(Table[#This Row])-4,FALSE))","v":0.1},0,null,null,75,1,null,1.4999999999999999E-2,0,50,0.1,null,50,0,15000,1000000,85,0.1,"X",0.1,0.1,0.1,0.1,"X","X",7.0000000000000007E-2,0.1,"X",0.1,0.1,7.0000000000000007E-2,7.0000000000000007E-2,0.1,7.0000000000000007E-2,0.1,"X","X","X",0.1,0.06,"X",0.06,7.0000000000000007E-2,0.1,7.0000000000000007E-2,7.0000000000000007E-2,"X",0.1,"X",0.06,0.1,"X","X","X",7.0000000000000007E-2,0.1,0.1,0.1,0.1,7.0000000000000007E-2,7.0000000000000007E-2,0.1,"X","X",0.1,0.1,0.1,65,{"$f":"IF(Table[[#This Row],[Bonus*]]=\"X\",\"n/a\",Premium*(1+Table[[#This Row],[Bonus*]]))","v":110000.00000000001},{"$f":"IFERROR(IF(Table[[#This Row],[Attained Age]]<Table[[#This Row],[Min Income Age]],0,NGBpayout),0)","v":3.15E-2},{"$f":"IF(OR(Defer<Table[[#This Row],[Required Deferral]],Table[[#This Row],[Bonus*]]=\"X\"),0,Table[[#This Row],[Benefit Base]]*Table[[#This Row],[Single Income Percentage]])","v":3465.0000000000005},"n/a",0,"AV",{"$f":"IF(Table[[#This Row],[Single Annual Income]]=0,0,MAX(Table[[#This Row],[Benefit Base]]*Table[[#This Row],[Increase Type]]/100,IF(Defer>3,Table[[#This Row],[Benefit Base]],Premium)-Table[[#This Row],[Benefit Base]]*(Table[[#This Row],[Single Income Percentage]]+Table[[#This Row],[Rider Fee]])*(Defer-1)))","v":82500.000000000015}]
["AltiSure","B+","BB+","Next Generation",{"$f":"IF(OR(Age<Table[[#This Row],[Min Issue Age]],Age>Table[[#This Row],[Max Issue]]),\"X\",HLOOKUP(State,States,ROW(Table[#This Row])-4,FALSE))","v":0},0,null,null,null,1,null,1.4999999999999999E-2,0,50,0.1,null,50,0,15000,1000000,85,0,"X",0,0,0,0,0,"X",0,0,"X",0,0,0,0,0,0,0,"X","X","X",0,0,"X",0,0,0,0,0,"X",0,"X",0,0,"X","X","X",0,0,0,0,0,0,0,0,"X","X",0,0,0,65,{"$f":"IF(Table[[#This Row],[Bonus*]]=\"X\",\"n/a\",Premium*(1+Table[[#This Row],[Bonus*]]))","v":100000},{"$f":"IFERROR(IF(Table[[#This Row],[Attained Age]]<Table[[#This Row],[Min Income Age]],0,NGpayout),0)","v":0},{"$f":"IF(OR(Defer<Table[[#This Row],[Required Deferral]],Table[[#This Row],[Bonus*]]=\"X\"),0,Table[[#This Row],[Benefit Base]]*Table[[#This Row],[Single Income Percentage]])","v":0},"n/a",0,"AV",{"$f":"IF(Table[[#This Row],[Single Annual Income]]=0,0,MAX(Table[[#This Row],[Benefit Base]]*Table[[#This Row],[Increase Type]]/100,IF(Defer>3,Table[[#This Row],[Benefit Base]],Premium)-Table[[#This Row],[Benefit Base]]*(Table[[#This Row],[Single Income Percentage]]+Table[[#This Row],[Rider Fee]])*(Defer-1)))","v":0}]
["American Equity1","A-","BBB+","LIBR-2010",{"$f":"IF(OR(Age<Table[[#This Row],[Min Issue Age]],Age>Table[[#This Row],[Max Issue]]),\"X\",HLOOKUP(State,States,ROW(Table[#This Row])-4,FALSE))","v":0.1},7.0000000000000007E-2,null,null,null,1,"AV",8.9999999999999993E-3,10,50,6.5000000000000002E-2,5.0000000000000001E-3,50,1,5000,{"$f":"IF(Age<70,1500000,IF(Age<75,1000000,750000))","v":1500000},80,"X",7.0000000000000007E-2,0.1,0.1,0.1,0.1,0,0.1,{"$f":"IF(Age<=64,10%,IF(Age<=78,8%,7%))","v":0.1},0.1,0.1,0.1,0.1,0.1,0.1,0.1,0.1,0.1,0.1,0.1,0.1,0.1,7.0000000000000007E-2,0.1,0.1,0.1,0.1,7.0000000000000007E-2,0.1,7.0000000000000007E-2,0.1,"X",0.1,0.1,7.0000000000000007E-2,0.1,7.0000000000000007E-2,0.1,0.1,0.1,0.1,0.1,7.0000000000000007E-2,7.0000000000000007E-2,0.1,0.1,7.0000000000000007E-2,0.1,0.1,0.1,65,{"$f":"IF(Table[[#This Row],[Bonus*]]=\"X\",\"n/a\",Premium*(1+Table[[#This Row],[Bonus*]])*IF(Table[[#This Row],[Increase Type]]=\"Simple\",1,(1+Table[[#This Row],[Annual Benefit Base Increase Rate]])^MIN(TRUNC(Defer,0),Table[[#This Row],[Max Years for Increase]]))+IF(Table[[#This Row],[Increase Type]]=\"Simple\",Table[[#This Row],[Annual Benefit Base Increase Rate]]*Premium*(1+Table[[#This Row],[Rollup Bonus?]]*Table[[#This Row],[Bonus*]])*MIN(TRUNC(Defer,0),Table[[#This Row],[Max Years for Increase]]),0))","v":216386.64930185225},{"$f":"IF(Table[[#This Row],[Attained Age]]<Table[[#This Row],[Min Income Age]],0,MIN(FLOOR(Table[[#This Row],[Attained Age]]-15,5)/1000,Table[[#This Row],[Max Payout]]))","v":0.05},{"$f":"IF(OR(Defer<Table[[#This Row],[Required Deferral]],Table[[#This Row],[Bonus*]]=\"X\"),0,Table[[#This Row],[Benefit Base]]*Table[[#This Row],[Single Income Percentage]])","v":10819.332465092613},{"$f":"IF(Table[[#This Row],[Single Income Percentage]]=0,0,Table[[#This Row],[Single Income Percentage]]-Table[[#This Row],[Joint Reduction]])","v":4.5000000000000005E-2},{"$f":"IF(Table[[#This Row],[Single Annual Income]]=0,0,Table[[#This Row],[Benefit Base]]*Table[[#This Row],[Joint Income Percentage]])","v":9737.3992185833522},"AV",0]
["American Equity1","A-","BBB+","LIBR-2010",{"$f":"IF(OR(Age<Table[[#This Row],[Min Issue Age]],Age>Table[[#This Row],[Max Issue]]),\"X\",HLOOKUP(State,States,ROW(Table[#This Row])-4,FALSE))","v":0.1},6.5000000000000002E-2,null,null,null,1,"AV",7.4999999999999997E-3,20,50,6.5000000000000002E-2,5.0000000000000001E-3,50,1,5000,{"$f":"IF(Age<70,1500000,IF(Age<75,1000000,750000))","v":1500000},80,"X",7.0000000000000007E-2,0.1,0.1,0.1,0.1,0,0.1,{"$f":"IF(Age<=64,10%,IF(Age<=78,8%,7%))","v":0.1},0.1,0.1,0.1,0.1,0.1,0.1,0.1,0.1,0.1,0.1,0.1,0.1,0.1,7.0000000000000007E-2,0.1,0.1,0.1,0.1,7.0000000000000007E-2,0.1,7.0000000000000007E-2,0.1,"X",0.1,0.1,7.0000000000000007E-2,0.1,7.0000000000000007E-2,0.1,0.1,0.1,0.1,0.1,7.0000000000000007E-2,7.0000000000000007E-2,0.1,0.1,7.0000000000000007E-2,0.1,0.1,0.1,65,{"$f":"IF(Table[[#This Row],[Bonus*]]=\"X\",\"n/a\",Premium*(1+Table[[#This Row],[Bonus*]])*IF(Table[[#This Row],[Increase Type]]=\"Simple\",1,(1+Table[[#This Row],[Annual Benefit Base Increase Rate]])^MIN(TRUNC(Defer,0),Table[[#This Row],[Max Years for Increase]]))+IF(Table[[#This Row],[Increase Type]]=\"Simple\",Table[[#This Row],[Annual Benefit Base Increase Rate]]*Premium*(1+Table[[#This Row],[Rollup Bonus?]]*Table[[#This Row],[Bonus*]])*MIN(TRUNC(Defer,0),Table[[#This Row],[Max Years for Increase]]),0))","v":206485.12117962947},{"$f":"IF(Table[[#This Row],[Attained Age]]<Table[[#This Row],[Min Income Age]],0,MIN(FLOOR(Table[[#This Row],[Attained Age]]-15,5)/1000,Table[[#This Row],[Max Payout]]))","v":0.05},{"$f":"IF(OR(Defer<Table[[#This Row],[Required Deferral]],Table[[#This Row],[Bonus*]]=\"X\"),0,Table[[#This Row],[Benefit Base]]*Table[[#This Row],[Single Income Percentage]])","v":10324.256058981475},{"$f":"IF(Table[[#This Row],[Single Income Percentage]]=0,0,Table[[#This Row],[Single Income Percentage]]-Table[[#This Row],[Joint Reduction]])","v":4.5000000000000005E-2},{"$f":"IF(Table[[#This Row],[Single Annual Income]]=0,0,Table[[#This Row],[Benefit Base]]*Table[[#This Row],[Joint Income Percentage]])","v":9291.8304530833266},"AV",0]
["American Equity1","A-","BBB+","LIBR-2010",{"$f":"IF(OR(Age<Table[[#This Row],[Min Issue Age]],Age>Table[[#This Row],[Max Issue]]),\"X\",HLOOKUP(State,States,ROW(Table[#This Row])-4,FALSE))","v":0.1},0.04,null,null,null,1,"AV",0,20,50,6.5000000000000002E-2,5.0000000000000001E-3,0,1,5000,{"$f":"IF(Age<70,1500000,IF(Age<75,1000000,750000))","v":1500000},80,"X",7.0000000000000007E-2,0.1,0.1,0.1,0.1,0,0.1,{"$f":"IF(Age<=64,10%,IF(Age<=78,8%,7%))","v":0.1},0.1,0.1,0.1,0.1,0.1,0.1,0.1,0.1,0.1,0.1,0.1,0.1,0.1,7.0000000000000007E-2,0.1,0.1,0.1,0.1,7.0000000000000007E-2,0.1,7.0000000000000007E-2,0.1,"X",0.1,0.1,7.0000000000000007E-2,0.1,7.0000000000000007E-2,0.1,0.1,0.1,0.1,0.1,7.0000000000000007E-2,7.0000000000000007E-2,0.1,0.1,7.0000000000000007E-2,0.1,0.1,0.1,65,{"$f":"IF(Table[[#This Row],[Bonus*]]=\"X\",\"n/a\",Premium*(1+Table[[#This Row],[Bonus*]])*IF(Table[[#This Row],[Increase Type]]=\"Simple\",1,(1+Table[[#This Row],[Annual Benefit Base Increase Rate]])^MIN(TRUNC(Defer,0),Table[[#This Row],[Max Years for Increase]]))+IF(Table[[#This Row],[Increase Type]]=\"Simple\",Table[[#This Row],[Annual Benefit Base Increase Rate]]*Premium*(1+Table[[#This Row],[Rollup Bonus?]]*Table[[#This Row],[Bonus*]])*MIN(TRUNC(Defer,0),Table[[#This Row],[Max Years for Increase]]),0))","v":162826.87134101792},{"$f":"IF(Table[[#This Row],[Attained Age]]<Table[[#This Row],[Min Income Age]],0,MIN(FLOOR(Table[[#This Row],[Attained Age]]-15,5)/1000,Table[[#This Row],[Max Payout]]))","v":0.05},{"$f":"IF(OR(Defer<Table[[#This Row],[Required Deferral]],Table[[#This Row],[Bonus*]]=\"X\"),0,Table[[#This Row],[Benefit Base]]*Table[[#This Row],[Single Income Percentage]])","v":8141.3435670508961},{"$f":"IF(Table[[#This Row],[Single Income Percentage]]=0,0,Table[[#This Row],[Single Income Percentage]]-Table[[#This Row],[Joint Reduction]])","v":4.5000000000000005E-2},{"$f":"IF(Table[[#This Row],[Single Annual Income]]=0,0,Table[[#This Row],[Benefit Base]]*Table[[#This Row],[Joint Income Percentage]])","v":7327.2092103458072},"IAV 5-yr",{"$f":"IF(OR(State=\"Connecticut\",State=\"Idaho\",State=\"Missouri\",State=\"Oregon\",State=\"Pennsylvania\",State=\"Washington\",Defer<2,Table[[#This Row],[Benefit Base]]=\"n/a\"),0,MIN(Premium*(1+Table[[#This Row],[Bonus*]])*(1+Table[[#This Row],[Annual Benefit Base Increase Rate]])^MIN(Defer,85-Age),Premium*(1+Table[[#This Row],[Bonus*]])*(1+Table[[#This Row],[Annual Benefit Base Increase Rate]])*2))","v":162826.87134101792}]
["American General","A","A+","Income Builder",{"$f":"IF(OR(Age<Table[[#This Row],[Min Issue Age]],Age>Table[[#This Row],[Max Issue]]),\"X\",HLOOKUP(State,States,ROW(Table[#This Row])-4,FALSE))","v":0.05},0.06,null,null,null,1,null,7.0000000000000001E-3,{"$f":"MAX(MIN(90-Age,20),0)","v":20},56,0.06,5.0000000000000001E-3,55,1,50000,1000000,85,0.05,"X",0.05,0.05,0.05,0.05,0.04,0.04,0.04,0.05,0.05,0.05,0.05,0.05,0.05,0.05,0.05,0.05,0.05,0.05,0.05,0.05,"X",0.05,0.05,0.05,0.05,0.04,0.05,0.04,0.05,"X",0.05,0.05,0.04,0.05,0.04,0.05,0.05,0.04,0.05,0.05,0.04,0.04,"X",0.05,"X",0.05,0.05,0.05,65,{"$f":"IF(Table[[#This Row],[Bonus*]]=\"X\",\"n/a\",Premium*(1+Table[[#This Row],[Bonus*]])*IF(Table[[#This Row],[Increase Type]]=\"Simple\",1,(1+Table[[#This Row],[Annual Benefit Base Increase Rate]])^MIN(TRUNC(Defer,0),Table[[#This Row],[Max Years for Increase]]))+IF(Table[[#This Row],[Increase Type]]=\"Simple\",Table[[#This Row],[Annual Benefit Base Increase Rate]]*Premium*(1+Table[[#This Row],[Rollup Bonus?]]*Table[[#This Row],[Bonus*]])*MIN(TRUNC(Defer,0),Table[[#This Row],[Max Years for Increase]]),0))","v":188039.00813699974},{"$f":"IF(Table[[#This Row],[Attained Age]]<Table[[#This Row],[Min Income Age]],0,MIN(FLOOR(Table[[#This Row],[Attained Age]]-20,5)/1000,Table[[#This Row],[Max Payout]]))","v":4.4999999999999998E-2},{"$f":"IF(OR(Defer<Table[[#This Row],[Required Deferral]],Table[[#This Row],[Bonus*]]=\"X\"),0,Table[[#This Row],[Benefit Base]]*Table[[#This Row],[Single Income Percentage]])","v":8461.7553661649872},{"$f":"IF(Table[[#This Row],[Single Income Percentage]]=0,0,Table[[#This Row],[Single Income Percentage]]-Table[[#This Row],[Joint Reduction]])","v":0.04},{"$f":"IF(Table[[#This Row],[Single Annual Income]]=0,0,Table[[#This Row],[Benefit Base]]*Table[[#This Row],[Joint Income Percentage]])","v":7521.5603254799898},"AV",0]
["Annexus BAA 10/12","A","A","BALIR SGO",{"$f":"IF(OR(Age<Table[[#This Row],[Min Issue Age]],Age>Table[[#This Row],[Max Issue]],HLOOKUP(State,States,ROW(Table[#This Row])-4,FALSE)=\"X\"),\"X\",HLOOKUP($I$2,States,ROW(Table[#This Row])-4,FALSE))","v":"X"},{"$f":"0.04","v":0.04},0.03,5,null,1,null,9.4999999999999998E-3,18,50,6.5000000000000002E-2,5.0000000000000001E-3,40,0,5000,1000000,76,"X",{"$f":"IF(Age>=60,0,\"X\")","v":"X"},"X","X","X","X",0,"X",{"$f":"IF(Age<=64,0.04,0)","v":0.04},"X","X","X",0.04,0.04,"X","X","X","X","X","X","X","X","X","X","X","X","X",{"$f":"IF(Age>=60,0,\"X\")","v":"X"},0.04,"X","X","X","X","X",{"$f":"IF(Age>=60,0,\"X\")","v":"X"},0.04,"X","X","X","X","X","X",{"$f":"IF(Age>=60,0,\"X\")","v":"X"},{"$f":"IF(Age>=60,0,\"X\")","v":"X"},"X",0.04,"X","X","X",0.04,65,{"$f":"IF(Table[[#This Row],[Bonus*]]=\"X\",\"n/a\",Premium*(1+Table[[#This Row],[Bonus*]])*IF(Table[[#This Row],[Increase Type]]=\"Simple\",1,(1+Table[[#This Row],[Annual Benefit Base Increase Rate]])^MIN(TRUNC(Defer,0),Table[[#This Row],[Rollup Switch]])*(1+Table[[#This Row],[Rollup2]])^MIN(MAX(TRUNC(Defer,0)-Table[[#This Row],[Rollup Switch]],0),Table[[#This Row],[Max Years for Increase]]-Table[[#This Row],[Rollup Switch]]))+IF(Table[[#This Row],[Increase Type]]=\"Simple\",Table[[#This Row],[Annual Benefit Base Increase Rate]]*Premium*(1+Table[[#This Row],[Rollup Bonus?]]*Table[[#This Row],[Bonus*]])*MIN(TRUNC(Defer,0),Table[[#This Row],[Max Years for Increase]]),0))","v":"n/a"},{"$f":"IF(Table[[#This Row],[Attained Age]]<Table[[#This Row],[Min Income Age]],0,IF(Table[[#This Row],[Attained Age]]<55,0.035,IF(Table[[#This Row],[Attained Age]]<60,0.04,IF(Table[[#This Row],[Attained Age]]<65,0.045,IF(Table[[#This Row],[Attained Age]]<70,0.05,IF(Table[[#This Row],[Attained Age]]<75,0.0525,IF(Table[[#This Row],[Attained Age]]<80,0.055,IF(Table[[#This Row],[Attained Age]]<85,0.06,IF(Table[[#This Row],[Attained Age]]<90,0.0625,Table[[#This Row],[Max Payout]])))))))))","v":0.05},{"$f":"IF(OR(Defer<Table[[#This Row],[Required Deferral]],Table[[#This Row],[Bonus*]]=\"X\"),0,Table[[#This Row],[Benefit Base]]*Table[[#This Row],[Single Income Percentage]])","v":0},{"$f":"IF(Table[[#This Row],[Single Income Percentage]]=0,0,Table[[#This Row],[Single Income Percentage]]-Table[[#This Row],[Joint Reduction]])","v":4.5000000000000005E-2},{"$f":"IF(Table[[#This Row],[Single Annual Income]]=0,0,Table[[#This Row],[Benefit Base]]*Table[[#This Row],[Joint Income Percentage]])","v":0},"Rider",{"$f":"IF(Table[[#This Row],[Bonus*]]=\"X\",0,Premium*(1.02)^MIN(Defer,90-Age))","v":0}]
["Annexus BAA 10/12","A","A","BALIR SGO MAX",{"$f":"IF(OR(Age<Table[[#This Row],[Min Issue Age]],Age>Table[[#This Row],[Max Issue]],HLOOKUP(State,States,ROW(Table[#This Row])-4,FALSE)=\"X\"),\"X\",HLOOKUP($I$2,States,ROW(Table[#This Row])-4,FALSE))","v":"X"},{"$f":"0.03","v":0.03},0.03,5,null,1,null,9.4999999999999998E-3,18,50,6.5000000000000002E-2,5.0000000000000001E-3,40,0,5000,1000000,76,"X",{"$f":"IF(Age>=60,0,\"X\")","v":"X"},"X","X","X","X",0,"X",{"$f":"IF(Age<=64,0.04,0)","v":0.04},"X","X","X",0.04,0.04,"X","X","X","X","X","X","X","X","X","X","X","X","X",{"$f":"IF(Age>=60,0,\"X\")","v":"X"},0.04,"X","X","X","X","X",{"$f":"IF(Age>=60,0,\"X\")","v":"X"},0.04,"X","X","X","X","X","X",{"$f":"IF(Age>=60,0,\"X\")","v":"X"},{"$f":"IF(Age>=60,0,\"X\")","v":"X"},"X",0.04,"X","X","X",0.04,65,{"$f":"IF(Table[[#This Row],[Bonus*]]=\"X\",\"n/a\",Premium*(1+Table[[#This Row],[Bonus*]])*IF(Table[[#This Row],[Increase Type]]=\"Simple\",1,(1+Table[[#This Row],[Annual Benefit Base Increase Rate]])^MIN(TRUNC(Defer,0),Table[[#This Row],[Rollup Switch]])*(1+Table[[#This Row],[Rollup2]])^MIN(MAX(TRUNC(Defer,0)-Table[[#This Row],[Rollup Switch]],0),Table[[#This Row],[Max Years for Increase]]-Table[[#This Row],[Rollup Switch]]))+IF(Table[[#This Row],[Increase Type]]=\"Simple\",Table[[#This Row],[Annual Benefit Base Increase Rate]]*Premium*(1+Table[[#This Row],[Rollup Bonus?]]*Table[[#This Row],[Bonus*]])*MIN(TRUNC(Defer,0),Table[[#This Row],[Max Years for Increase]]),0))","v":"n/a"},{"$f":"IF(Table[[#This Row],[Attained Age]]<Table[[#This Row],[Min Income Age]],0,IF(Table[[#This Row],[Attained Age]]<55,0.035,IF(Table[[#This Row],[Attained Age]]<60,0.04,IF(Table[[#This Row],[Attained Age]]<65,0.045,IF(Table[[#This Row],[Attained Age]]<70,0.05,IF(Table[[#This Row],[Attained Age]]<75,0.0525,IF(Table[[#This Row],[Attained Age]]<80,0.055,IF(Table[[#This Row],[Attained Age]]<85,0.06,IF(Table[[#This Row],[Attained Age]]<90,0.0625,Table[[#This Row],[Max Payout]])))))))))","v":0.05},{"$f":"IF(OR(Defer<Table[[#This Row],[Required Deferral]],Table[[#This Row],[Bonus*]]=\"X\"),0,Table[[#This Row],[Benefit Base]]*Table[[#This Row],[Single Income Percentage]])","v":0},{"$f":"IF(Table[[#This Row],[Single Income Percentage]]=0,0,Table[[#This Row],[Single Income Percentage]]-Table[[#This Row],[Joint Reduction]])","v":4.5000000000000005E-2},{"$f":"IF(Table[[#This Row],[Single Annual Income]]=0,0,Table[[#This Row],[Benefit Base]]*Table[[#This Row],[Joint Income Percentage]])","v":0},"Rider",{"$f":"IF(Table[[#This Row],[Bonus*]]=\"X\",0,Premium*(1.02)^MIN(Defer,90-Age))","v":0}]
["Annexus BAA 8","A","A","BALIR SGO",{"$f":"IF(OR(Age<Table[[#This Row],[Min Issue Age]],Age>Table[[#This Row],[Max Issue]],HLOOKUP(State,States,ROW(Table[#This Row])-4,FALSE)=\"X\"),\"X\",HLOOKUP($I$2,States,ROW(Table[#This Row])-4,FALSE))","v":"X"},{"$f":"0.04","v":0.04},0.04,10,null,1,null,9.4999999999999998E-3,18,50,6.5000000000000002E-2,5.0000000000000001E-3,40,0,5000,1000000,80,"X",0.02,"X","X","X","X",0,0.02,0.02,"X","X","X",0.02,0.02,"X","X","X","X","X","X","X","X",0.02,"X","X","X","X",0.02,0.02,"X","X","X","X","X",0.02,0.02,"X","X","X","X","X","X",0.02,0.02,"X",0.02,"X","X","X",0.02,65,{"$f":"IF(Table[[#This Row],[Bonus*]]=\"X\",\"n/a\",Premium*(1+Table[[#This Row],[Bonus*]])*IF(Table[[#This Row],[Increase Type]]=\"Simple\",1,(1+Table[[#This Row],[Annual Benefit Base Increase Rate]])^MIN(TRUNC(Defer,0),Table[[#This Row],[Rollup Switch]])*(1+Table[[#This Row],[Rollup2]])^MIN(MAX(TRUNC(Defer,0)-Table[[#This Row],[Rollup Switch]],0),Table[[#This Row],[Max Years for Increase]]-Table[[#This Row],[Rollup Switch]]))+IF(Table[[#This Row],[Increase Type]]=\"Simple\",Table[[#This Row],[Annual Benefit Base Increase Rate]]*Premium*(1+Table[[#This Row],[Rollup Bonus?]]*Table[[#This Row],[Bonus*]])*MIN(TRUNC(Defer,0),Table[[#This Row],[Max Years for Increase]]),0))","v":"n/a"},{"$f":"IF(Table[[#This Row],[Attained Age]]<Table[[#This Row],[Min Income Age]],0,IF(Table[[#This Row],[Attained Age]]<55,0.035,IF(Table[[#This Row],[Attained Age]]<60,0.04,IF(Table[[#This Row],[Attained Age]]<65,0.045,IF(Table[[#This Row],[Attained Age]]<70,0.05,IF(Table[[#This Row],[Attained Age]]<75,0.0525,IF(Table[[#This Row],[Attained Age]]<80,0.055,IF(Table[[#This Row],[Attained Age]]<85,0.06,IF(Table[[#This Row],[Attained Age]]<90,0.0625,Table[[#This Row],[Max Payout]])))))))))","v":0.05},{"$f":"IF(OR(Defer<Table[[#This Row],[Required Deferral]],Table[[#This Row],[Bonus*]]=\"X\"),0,Table[[#This Row],[Benefit Base]]*Table[[#This Row],[Single Income Percentage]])","v":0},{"$f":"IF(Table[[#This Row],[Single Income Percentage]]=0,0,Table[[#This Row],[Single Income Percentage]]-Table[[#This Row],[Joint Reduction]])","v":4.5000000000000005E-2},{"$f":"IF(Table[[#This Row],[Single Annual Income]]=0,0,Table[[#This Row],[Benefit Base]]*Table[[#This Row],[Joint Income Percentage]])","v":0},"Rider",{"$f":"IF(Table[[#This Row],[Bonus*]]=\"X\",0,Premium*(1.02)^MIN(Defer,90-Age))","v":0}]
["Annexus BAA 8","A","A","BALIR SGO MAX",{"$f":"IF(OR(Age<Table[[#This Row],[Min Issue Age]],Age>Table[[#This Row],[Max Issue]],HLOOKUP(State,States,ROW(Table[#This Row])-4,FALSE)=\"X\"),\"X\",HLOOKUP($I$2,States,ROW(Table[#This Row])-4,FALSE))","v":"X"},{"$f":"0.03","v":0.03},0.04,10,null,1,null,9.4999999999999998E-3,18,50,6.5000000000000002E-2,5.0000000000000001E-3,40,0,5000,1000000,80,"X",0.02,"X","X","X","X",0,0.02,0.02,"X","X","X",0.02,0.02,"X","X","X","X","X","X","X","X",0.02,"X","X","X","X",0.02,0.02,"X","X","X","X","X",0.02,0.02,"X","X","X","X","X","X",0.02,0.02,"X",0.02,"X","X","X",0.02,65,{"$f":"IF(Table[[#This Row],[Bonus*]]=\"X\",\"n/a\",Premium*(1+Table[[#This Row],[Bonus*]])*IF(Table[[#This Row],[Increase Type]]=\"Simple\",1,(1+Table[[#This Row],[Annual Benefit Base Increase Rate]])^MIN(TRUNC(Defer,0),Table[[#This Row],[Rollup Switch]])*(1+Table[[#This Row],[Rollup2]])^MIN(MAX(TRUNC(Defer,0)-Table[[#This Row],[Rollup Switch]],0),Table[[#This Row],[Max Years for Increase]]-Table[[#This Row],[Rollup Switch]]))+IF(Table[[#This Row],[Increase Type]]=\"Simple\",Table[[#This Row],[Annual Benefit Base Increase Rate]]*Premium*(1+Table[[#This Row],[Rollup Bonus?]]*Table[[#This Row],[Bonus*]])*MIN(TRUNC(Defer,0),Table[[#This Row],[Max Years for Increase]]),0))","v":"n/a"},{"$f":"IF(Table[[#This Row],[Attained Age]]<Table[[#This Row],[Min Income Age]],0,IF(Table[[#This Row],[Attained Age]]<55,0.035,IF(Table[[#This Row],[Attained Age]]<60,0.04,IF(Table[[#This Row],[Attained Age]]<65,0.045,IF(Table[[#This Row],[Attained Age]]<70,0.05,IF(Table[[#This Row],[Attained Age]]<75,0.0525,IF(Table[[#This Row],[Attained Age]]<80,0.055,IF(Table[[#This Row],[Attained Age]]<85,0.06,IF(Table[[#This Row],[Attained Age]]<90,0.0625,Table[[#This Row],[Max Payout]])))))))))","v":0.05},{"$f":"IF(OR(Defer<Table[[#This Row],[Required Deferral]],Table[[#This Row],[Bonus*]]=\"X\"),0,Table[[#This Row],[Benefit Base]]*Table[[#This Row],[Single Income Percentage]])","v":0},{"$f":"IF(Table[[#This Row],[Single Income Percentage]]=0,0,Table[[#This Row],[Single Income Percentage]]-Table[[#This Row],[Joint Reduction]])","v":4.5000000000000005E-2},{"$f":"IF(Table[[#This Row],[Single Annual Income]]=0,0,Table[[#This Row],[Benefit Base]]*Table[[#This Row],[Joint Income Percentage]])","v":0},"Rider",{"$f":"IF(Table[[#This Row],[Bonus*]]=\"X\",0,Premium*(1.02)^MIN(Defer,90-Age))","v":0}]
["Annexus BCA 10/8","A","A","BALIR SGO",{"$f":"IF(OR(Age<Table[[#This Row],[Min Issue Age]],Age>Table[[#This Row],[Max Issue]],HLOOKUP(State,States,ROW(Table[#This Row])-4,FALSE)=\"X\"),\"X\",HLOOKUP($I$2,States,ROW(Table[#This Row])-4,FALSE))","v":0.05},{"$f":"0.04","v":0.04},0.04,10,null,1,null,9.4999999999999998E-3,18,50,6.5000000000000002E-2,5.0000000000000001E-3,40,0,5000,1000000,80,0.05,"X",0.05,0.05,0.05,0.05,"X","X","X",0.05,0.05,0.05,"X","X",0.05,0.05,0.05,0.05,0.05,0.05,0.05,0.05,0.02,0.05,0.05,0.05,0.05,"X","X",0,0.05,"X",0.05,0.05,"X","X","X",0,0.05,0,0.05,0.05,"X","X",0.05,"X","X",0.05,0.05,"X",65,{"$f":"IF(Table[[#This Row],[Bonus*]]=\"X\",\"n/a\",Premium*(1+Table[[#This Row],[Bonus*]])*IF(Table[[#This Row],[Increase Type]]=\"Simple\",1,(1+Table[[#This Row],[Annual Benefit Base Increase Rate]])^MIN(TRUNC(Defer,0),Table[[#This Row],[Rollup Switch]])*(1+Table[[#This Row],[Rollup2]])^MIN(MAX(TRUNC(Defer,0)-Table[[#This Row],[Rollup Switch]],0),Table[[#This Row],[Max Years for Increase]]-Table[[#This Row],[Rollup Switch]]))+IF(Table[[#This Row],[Increase Type]]=\"Simple\",Table[[#This Row],[Annual Benefit Base Increase Rate]]*Premium*(1+Table[[#This Row],[Rollup Bonus?]]*Table[[#This Row],[Bonus*]])*MIN(TRUNC(Defer,0),Table[[#This Row],[Max Years for Increase]]),0))","v":155425.64991642619},{"$f":"IF(Table[[#This Row],[Attained Age]]<Table[[#This Row],[Min Income Age]],0,IF(Table[[#This Row],[Attained Age]]<55,0.035,IF(Table[[#This Row],[Attained Age]]<60,0.04,IF(Table[[#This Row],[Attained Age]]<65,0.045,IF(Table[[#This Row],[Attained Age]]<70,0.05,IF(Table[[#This Row],[Attained Age]]<75,0.0525,IF(Table[[#This Row],[Attained Age]]<80,0.055,IF(Table[[#This Row],[Attained Age]]<85,0.06,IF(Table[[#This Row],[Attained Age]]<90,0.0625,Table[[#This Row],[Max Payout]])))))))))","v":0.05},{"$f":"IF(OR(Defer<Table[[#This Row],[Required Deferral]],Table[[#This Row],[Bonus*]]=\"X\"),0,Table[[#This Row],[Benefit Base]]*Table[[#This Row],[Single Income Percentage]])","v":7771.2824958213096},{"$f":"IF(Table[[#This Row],[Single Income Percentage]]=0,0,Table[[#This Row],[Single Income Percentage]]-Table[[#This Row],[Joint Reduction]])","v":4.5000000000000005E-2},{"$f":"IF(Table[[#This Row],[Single Annual Income]]=0,0,Table[[#This Row],[Benefit Base]]*Table[[#This Row],[Joint Income Percentage]])","v":6994.1542462391799},"Rider",{"$f":"IF(Table[[#This Row],[Bonus*]]=\"X\",0,Premium*(1.02)^MIN(Defer,90-Age))","v":121899.4419994757}]
["Annexus BCA 10/8","A","A","BALIR SGO MAX",{"$f":"IF(OR(Age<Table[[#This Row],[Min Issue Age]],Age>Table[[#This Row],[Max Issue]],HLOOKUP(State,States,ROW(Table[#This Row])-4,FALSE)=\"X\"),\"X\",HLOOKUP($I$2,States,ROW(Table[#This Row])-4,FALSE))","v":0.05},{"$f":"0.03","v":0.03},0.04,10,null,1,null,9.4999999999999998E-3,18,50,6.5000000000000002E-2,5.0000000000000001E-3,40,0,5000,1000000,80,0.05,"X",0.05,0.05,0.05,0.05,"X","X","X",0.05,0.05,0.05,"X","X",0.05,0.05,0.05,0.05,0.05,0.05,0.05,0.05,0.02,0.05,0.05,0.05,0.05,"X","X",0,0.05,"X",0.05,0.05,"X","X","X",0,0.05,0,0.05,0.05,"X","X",0.05,"X","X",0.05,0.05,"X",65,{"$f":"IF(Table[[#This Row],[Bonus*]]=\"X\",\"n/a\",Premium*(1+Table[[#This Row],[Bonus*]])*IF(Table[[#This Row],[Increase Type]]=\"Simple\",1,(1+Table[[#This Row],[Annual Benefit Base Increase Rate]])^MIN(TRUNC(Defer,0),Table[[#This Row],[Rollup Switch]])*(1+Table[[#This Row],[Rollup2]])^MIN(MAX(TRUNC(Defer,0)-Table[[#This Row],[Rollup Switch]],0),Table[[#This Row],[Max Years for Increase]]-Table[[#This Row],[Rollup Switch]]))+IF(Table[[#This Row],[Increase Type]]=\"Simple\",Table[[#This Row],[Annual Benefit Base Increase Rate]]*Premium*(1+Table[[#This Row],[Rollup Bonus?]]*Table[[#This Row],[Bonus*]])*MIN(TRUNC(Defer,0),Table[[#This Row],[Max Years for Increase]]),0))","v":141111.2198311328},{"$f":"IF(Table[[#This Row],[Attained Age]]<Table[[#This Row],[Min Income Age]],0,IF(Table[[#This Row],[Attained Age]]<55,0.035,IF(Table[[#This Row],[Attained Age]]<60,0.04,IF(Table[[#This Row],[Attained Age]]<65,0.045,IF(Table[[#This Row],[Attained Age]]<70,0.05,IF(Table[[#This Row],[Attained Age]]<75,0.0525,IF(Table[[#This Row],[Attained Age]]<80,0.055,IF(Table[[#This Row],[Attained Age]]<85,0.06,IF(Table[[#This Row],[Attained Age]]<90,0.0625,Table[[#This Row],[Max Payout]])))))))))","v":0.05},{"$f":"IF(OR(Defer<Table[[#This Row],[Required Deferral]],Table[[#This Row],[Bonus*]]=\"X\"),0,Table[[#This Row],[Benefit Base]]*Table[[#This Row],[Single Income Percentage]])","v":7055.5609915566401},{"$f":"IF(Table[[#This Row],[Single Income Percentage]]=0,0,Table[[#This Row],[Single Income Percentage]]-Table[[#This Row],[Joint Reduction]])","v":4.5000000000000005E-2},{"$f":"IF(Table[[#This Row],[Single Annual Income]]=0,0,Table[[#This Row],[Benefit Base]]*Table[[#This Row],[Joint Income Percentage]])","v":6350.0048924009761},"Rider",{"$f":"IF(Table[[#This Row],[Bonus*]]=\"X\",0,Premium*(1.02)^MIN(Defer,90-Age))","v":121899.4419994757}]
["Annexus BCA 12","A","A","BALIR SGO",{"$f":"IF(OR(Age<Table[[#This Row],[Min Issue Age]],Age>Table[[#This Row],[Max Issue]],HLOOKUP(State,States,ROW(Table[#This Row])-4,FALSE)=\"X\"),\"X\",HLOOKUP($I$2,States,ROW(Table[#This Row])-4,FALSE))","v":7.0000000000000007E-2},{"$f":"0.04","v":0.04},0.03,5,null,1,null,9.4999999999999998E-3,18,50,6.5000000000000002E-2,5.0000000000000001E-3,40,0,5000,1000000,76,7.0000000000000007E-2,"X",7.0000000000000007E-2,7.0000000000000007E-2,7.0000000000000007E-2,7.0000000000000007E-2,"X","X","X",7.0000000000000007E-2,7.0000000000000007E-2,7.0000000000000007E-2,"X","X",7.0000000000000007E-2,7.0000000000000007E-2,7.0000000000000007E-2,7.0000000000000007E-2,7.0000000000000007E-2,7.0000000000000007E-2,7.0000000000000007E-2,7.0000000000000007E-2,"X",7.0000000000000007E-2,7.0000000000000007E-2,7.0000000000000007E-2,7.0000000000000007E-2,"X","X","X",7.0000000000000007E-2,"X",7.0000000000000007E-2,7.0000000000000007E-2,"X","X","X","X",7.0000000000000007E-2,"X",7.0000000000000007E-2,7.0000000000000007E-2,"X","X",7.0000000000000007E-2,"X","X",7.0000000000000007E-2,7.0000000000000007E-2,"X",65,{"$f":"IF(Table[[#This Row],[Bonus*]]=\"X\",\"n/a\",Premium*(1+Table[[#This Row],[Bonus*]])*IF(Table[[#This Row],[Increase Type]]=\"Simple\",1,(1+Table[[#This Row],[Annual Benefit Base Increase Rate]])^MIN(TRUNC(Defer,0),Table[[#This Row],[Rollup Switch]])*(1+Table[[#This Row],[Rollup2]])^MIN(MAX(TRUNC(Defer,0)-Table[[#This Row],[Rollup Switch]],0),Table[[#This Row],[Max Years for Increase]]-Table[[#This Row],[Rollup Switch]]))+IF(Table[[#This Row],[Increase Type]]=\"Simple\",Table[[#This Row],[Annual Benefit Base Increase Rate]]*Premium*(1+Table[[#This Row],[Rollup Bonus?]]*Table[[#This Row],[Bonus*]])*MIN(TRUNC(Defer,0),Table[[#This Row],[Max Years for Increase]]),0))","v":150916.45588763602},{"$f":"IF(Table[[#This Row],[Attained Age]]<Table[[#This Row],[Min Income Age]],0,IF(Table[[#This Row],[Attained Age]]<55,0.035,IF(Table[[#This Row],[Attained Age]]<60,0.04,IF(Table[[#This Row],[Attained Age]]<65,0.045,IF(Table[[#This Row],[Attained Age]]<70,0.05,IF(Table[[#This Row],[Attained Age]]<75,0.0525,IF(Table[[#This Row],[Attained Age]]<80,0.055,IF(Table[[#This Row],[Attained Age]]<85,0.06,IF(Table[[#This Row],[Attained Age]]<90,0.0625,Table[[#This Row],[Max Payout]])))))))))","v":0.05},{"$f":"IF(OR(Defer<Table[[#This Row],[Required Deferral]],Table[[#This Row],[Bonus*]]=\"X\"),0,Table[[#This Row],[Benefit Base]]*Table[[#This Row],[Single Income Percentage]])","v":7545.8227943818019},{"$f":"IF(Table[[#This Row],[Single Income Percentage]]=0,0,Table[[#This Row],[Single Income Percentage]]-Table[[#This Row],[Joint Reduction]])","v":4.5000000000000005E-2},{"$f":"IF(Table[[#This Row],[Single Annual Income]]=0,0,Table[[#This Row],[Benefit Base]]*Table[[#This Row],[Joint Income Percentage]])","v":6791.2405149436217},"Rider",{"$f":"IF(Table[[#This Row],[Bonus*]]=\"X\",0,Premium*(1.02)^MIN(Defer,90-Age))","v":121899.4419994757}]
["Annexus BCA 12","A","A","BALIR SGO MAX",{"$f":"IF(OR(Age<Table[[#This Row],[Min Issue Age]],Age>Table[[#This Row],[Max Issue]],HLOOKUP(State,States,ROW(Table[#This Row])-4,FALSE)=\"X\"),\"X\",HLOOKUP($I$2,States,ROW(Table[#This Row])-4,FALSE))","v":7.0000000000000007E-2},{"$f":"0.03","v":0.03},0.03,5,null,1,null,9.4999999999999998E-3,18,50,6.5000000000000002E-2,5.0000000000000001E-3,40,0,5000,1000000,76,7.0000000000000007E-2,"X",7.0000000000000007E-2,7.0000000000000007E-2,7.0000000000000007E-2,7.0000000000000007E-2,"X","X","X",7.0000000000000007E-2,7.0000000000000007E-2,7.0000000000000007E-2,"X","X",7.0000000000000007E-2,7.0000000000000007E-2,7.0000000000000007E-2,7.0000000000000007E-2,7.0000000000000007E-2,7.0000000000000007E-2,7.0000000000000007E-2,7.0000000000000007E-2,"X",7.0000000000000007E-2,7.0000000000000007E-2,7.0000000000000007E-2,7.0000000000000007E-2,"X","X","X",7.0000000000000007E-2,"X",7.0000000000000007E-2,7.0000000000000007E-2,"X","X","X","X",7.0000000000000007E-2,"X",7.0000000000000007E-2,7.0000000000000007E-2,"X","X",7.0000000000000007E-2,"X","X",7.0000000000000007E-2,7.0000000000000007E-2,"X",65,{"$f":"IF(Table[[#This Row],[Bonus*]]=\"X\",\"n/a\",Premium*(1+Table[[#This Row],[Bonus*]])*IF(Table[[#This Row],[Increase Type]]=\"Simple\",1,(1+Table[[#This Row],[Annual Benefit Base Increase Rate]])^MIN(TRUNC(Defer,0),Table[[#This Row],[Rollup Switch]])*(1+Table[[#This Row],[Rollup2]])^MIN(MAX(TRUNC(Defer,0)-Table[[#This Row],[Rollup Switch]],0),Table[[#This Row],[Max Years for Increase]]-Table[[#This Row],[Rollup Switch]]))+IF(Table[[#This Row],[Increase Type]]=\"Simple\",Table[[#This Row],[Annual Benefit Base Increase Rate]]*Premium*(1+Table[[#This Row],[Rollup Bonus?]]*Table[[#This Row],[Bonus*]])*MIN(TRUNC(Defer,0),Table[[#This Row],[Max Years for Increase]]),0))","v":143799.05258982102},{"$f":"IF(Table[[#This Row],[Attained Age]]<Table[[#This Row],[Min Income Age]],0,IF(Table[[#This Row],[Attained Age]]<55,0.035,IF(Table[[#This Row],[Attained Age]]<60,0.04,IF(Table[[#This Row],[Attained Age]]<65,0.045,IF(Table[[#This Row],[Attained Age]]<70,0.05,IF(Table[[#This Row],[Attained Age]]<75,0.0525,IF(Table[[#This Row],[Attained Age]]<80,0.055,IF(Table[[#This Row],[Attained Age]]<85,0.06,IF(Table[[#This Row],[Attained Age]]<90,0.0625,Table[[#This Row],[Max Payout]])))))))))","v":0.05},{"$f":"IF(OR(Defer<Table[[#This Row],[Required Deferral]],Table[[#This Row],[Bonus*]]=\"X\"),0,Table[[#This Row],[Benefit Base]]*Table[[#This Row],[Single Income Percentage]])","v":7189.9526294910511},{"$f":"IF(Table[[#This Row],[Single Income Percentage]]=0,0,Table[[#This Row],[Single Income Percentage]]-Table[[#This Row],[Joint Reduction]])","v":4.5000000000000005E-2},{"$f":"IF(Table[[#This Row],[Single Annual Income]]=0,0,Table[[#This Row],[Benefit Base]]*Table[[#This Row],[Joint Income Percentage]])","v":6470.9573665419466},"Rider",{"$f":"IF(Table[[#This Row],[Bonus*]]=\"X\",0,Premium*(1.02)^MIN(Defer,90-Age))","v":121899.4419994757}]
["Athene","B++",null,"GLWB",{"$f":"IFERROR(IF(OR(Age<Table[[#This Row],[Min Issue Age]],Age>Table[[#This Row],[Max Issue]]),\"X\",HLOOKUP(State,States,ROW(Table[#This Row])-4,FALSE)+1%),\"X\")","v":6.0000000000000005E-2},6.5000000000000002E-2,null,null,null,1,null,1.2500000000000001E-2,10,50,7.4999999999999997E-2,0.01,40,1,5000,1000000,80,0.05,"X",0.05,0.05,0.05,0.05,"X","X",0.05,0.05,"X",0.05,0.05,0.05,0.05,0.05,0.05,0.05,0.05,0.05,0.05,0.05,"X",0.05,0.05,0.05,0.05,0.05,0.05,"X",0.05,"X",0.05,0.05,0.05,"X","X","X",0.05,0.05,0.05,0.05,0.02,"X",0.05,0.05,"X",0.05,0.05,0.05,65,{"$f":"IF(Table[[#This Row],[Bonus*]]=\"X\",\"n/a\",Premium*(1+Table[[#This Row],[Bonus*]])*IF(Table[[#This Row],[Increase Type]]=\"Simple\",1,(1+Table[[#This Row],[Annual Benefit Base Increase Rate]])^MIN(TRUNC(Defer,0),Table[[#This Row],[Max Years for Increase]]))+IF(Table[[#This Row],[Increase Type]]=\"Simple\",Table[[#This Row],[Annual Benefit Base Increase Rate]]*Premium*(1+Table[[#This Row],[Rollup Bonus?]]*Table[[#This Row],[Bonus*]])*MIN(TRUNC(Defer,0),Table[[#This Row],[Max Years for Increase]]),0))","v":198976.57131855201},{"$f":"IF(Table[[#This Row],[Attained Age]]<Table[[#This Row],[Min Income Age]],0,MIN(FLOOR(Table[[#This Row],[Attained Age]]-15,5)/1000,Table[[#This Row],[Max Payout]]))","v":0.05},{"$f":"IF(OR(Defer<Table[[#This Row],[Required Deferral]],Table[[#This Row],[Bonus*]]=\"X\"),0,Table[[#This Row],[Benefit Base]]*Table[[#This Row],[Single Income Percentage]])","v":9948.8285659276007},{"$f":"IF(Table[[#This Row],[Single Income Percentage]]=0,0,Table[[#This Row],[Single Income Percentage]]-Table[[#This Row],[Joint Reduction]])","v":0.04},{"$f":"IF(Table[[#This Row],[Single Annual Income]]=0,0,Table[[#This Row],[Benefit Base]]*Table[[#This Row],[Joint Income Percentage]])","v":7959.0628527420804},"AV",0]
["Athene","B++","A-","Lifetime Pay Plus",{"$f":"IF(OR(Age<Table[[#This Row],[Min Issue Age]],Age>Table[[#This Row],[Max Issue]],HLOOKUP(State,States,ROW(Table[#This Row])-4,FALSE)=\"X\"),\"X\",HLOOKUP($I$2,States,ROW(Table[#This Row])-4,FALSE))","v":0.04},0.06,null,null,null,1,null,7.4999999999999997E-3,20,50,6.5000000000000002E-2,5.0000000000000001E-3,40,0,5000,1000000,80,0.04,0.01,0.04,0.04,0.04,0.04,0.01,0.05,0.04,0.04,0.04,0.04,0.04,0.04,0.04,0.04,0.04,0.04,0.04,0.04,0.04,0.04,0.01,0.04,0.04,0.04,0.04,0.01,0.04,0.03,0.04,"X",0.04,0.04,0.03,0.04,0.05,0.03,0.04,0.04,0.04,0.04,0.04,0.01,0.04,0.04,"X",0.04,0.04,0.04,65,{"$f":"IF(Table[[#This Row],[Bonus*]]=\"X\",\"n/a\",Premium*(1+Table[[#This Row],[Bonus*]])*IF(Table[[#This Row],[Increase Type]]=\"Simple\",1,(1+Table[[#This Row],[Annual Benefit Base Increase Rate]])^MIN(Defer,Table[[#This Row],[Max Years for Increase]]))+IF(Table[[#This Row],[Increase Type]]=\"Simple\",Table[[#This Row],[Annual Benefit Base Increase Rate]]*Premium*(1+Table[[#This Row],[Rollup Bonus?]]*Table[[#This Row],[Bonus*]])*MIN(Defer,Table[[#This Row],[Max Years for Increase]]),0))","v":186248.16044045688},{"$f":"IF(Table[[#This Row],[Attained Age]]<Table[[#This Row],[Min Income Age]],0,IF(Table[[#This Row],[Attained Age]]<55,0.035,IF(Table[[#This Row],[Attained Age]]<60,0.04,IF(Table[[#This Row],[Attained Age]]<65,0.045,IF(Table[[#This Row],[Attained Age]]<70,0.05,IF(Table[[#This Row],[Attained Age]]<75,0.0525,IF(Table[[#This Row],[Attained Age]]<80,0.055,IF(Table[[#This Row],[Attained Age]]<85,0.06,IF(Table[[#This Row],[Attained Age]]<90,0.0625,Table[[#This Row],[Max Payout]])))))))))","v":0.05},{"$f":"IF(OR(Defer<Table[[#This Row],[Required Deferral]],Table[[#This Row],[Bonus*]]=\"X\"),0,Table[[#This Row],[Benefit Base]]*Table[[#This Row],[Single Income Percentage]])","v":9312.4080220228443},{"$f":"IF(Table[[#This Row],[Single Income Percentage]]=0,0,Table[[#This Row],[Single Income Percentage]]-Table[[#This Row],[Joint Reduction]])","v":4.5000000000000005E-2},{"$f":"IF(Table[[#This Row],[Single Annual Income]]=0,0,Table[[#This Row],[Benefit Base]]*Table[[#This Row],[Joint Income Percentage]])","v":8381.1672198205597},"AV",0]
["Athene","B++","A-","Target Pay 10",{"$f":"IF(OR(Age<Table[[#This Row],[Min Issue Age]],Age>Table[[#This Row],[Max Issue]],HLOOKUP(State,States,ROW(Table[#This Row])-4,FALSE)=\"X\"),\"X\",HLOOKUP($I$2,States,ROW(Table[#This Row])-4,FALSE))","v":0.06},0,null,null,null,1,null,1.2500000000000001E-2,"none",50,null,null,40,0,5000,1000000,78,{"$f":"IF(Premium<50000,0.05,0.06)","v":0.06},{"$f":"IF(Age<=55,IF(Premium<50000,0.03,0.04),\"0\")","v":0.04},{"$f":"IF(Premium<50000,0.05,0.06)","v":0.06},{"$f":"IF(Premium<50000,0.05,0.06)","v":0.06},{"$f":"IF(Premium<50000,0.05,0.06)","v":0.06},{"$f":"IF(Premium<50000,0.05,0.06)","v":0.06},{"$f":"IF(Premium<50000,0.05,0.06)","v":0.06},"X",{"$f":"IF(Premium<50000,0.05,0.06)","v":0.06},0.06,0.06,0.06,0.06,0.06,0.06,0.06,0.06,0.06,0.06,0.06,0.06,0.06,{"$f":"IF(Age<=52,IF(Premium<50000,0.03,0.04),\"0\")","v":"0"},{"$f":"IF(Premium<50000,0.05,0.06)","v":0.06},{"$f":"IF(Premium<50000,0.05,0.06)","v":0.06},{"$f":"IF(Premium<50000,0.05,0.06)","v":0.06},{"$f":"IF(Premium<50000,0.05,0.06)","v":0.06},{"$f":"IF(Age<=55,IF(Premium<50000,0.03,0.04),\"0\")","v":0.04},{"$f":"IF(Premium<50000,0.05,0.06)","v":0.06},{"$f":"IF(Age<=55,IF(Premium<50000,0.03,0.04),\"0\")","v":0.04},{"$f":"IF(Premium<50000,0.05,0.06)","v":0.06},"X",{"$f":"IF(Premium<50000,0.05,0.06)","v":0.06},{"$f":"IF(Premium<50000,0.05,0.06)","v":0.06},{"$f":"IF(Age<=52,IF(Premium<50000,0.03,0.04),\"0\")","v":"0"},"X","X",{"$f":"IF(Age<=55,IF(Premium<50000,0.03,0.04),\"0\")","v":0.04},{"$f":"IF(Premium<50000,0.05,0.06)","v":0.06},{"$f":"IF(Age<=55,IF(Premium<50000,0.03,0.04),\"0\")","v":0.04},{"$f":"IF(Premium<50000,0.05,0.06)","v":0.06},{"$f":"IF(Premium<50000,0.05,0.06)","v":0.06},"X",{"$f":"IF(Age<=52,IF(Premium<50000,0.03,0.04),\"0\")","v":"0"},{"$f":"IF(Premium<50000,0.05,0.06)","v":0.06},"X","X",{"$f":"IF(Premium<50000,0.05,0.06)","v":0.06},{"$f":"IF(Premium<50000,0.05,0.06)","v":0.06},{"$f":"IF(Premium<50000,0.05,0.06)","v":0.06},65,{"$f":"IF(Table[[#This Row],[Bonus*]]=\"X\",\"n/a\",Premium)","v":100000},{"$f":"T10S!$A$1","v":8.6580000000000004E-2},{"$f":"IF(OR(Defer<Table[[#This Row],[Required Deferral]],Table[[#This Row],[Bonus*]]=\"X\"),0,Table[[#This Row],[Benefit Base]]*Table[[#This Row],[Single Income Percentage]])","v":8658},{"$f":"T10J!$A$1","v":7.7920000000000003E-2},{"$f":"IF(Table[[#This Row],[Single Annual Income]]=0,0,Table[[#This Row],[Benefit Base]]*Table[[#This Row],[Joint Income Percentage]])","v":7792},"AV",0]
["Athene","B++","A-","Target Pay 15",{"$f":"IF(OR(Age<Table[[#This Row],[Min Issue Age]],Age>Table[[#This Row],[Max Issue]],HLOOKUP(State,States,ROW(Table[#This Row])-4,FALSE)=\"X\"),\"X\",HLOOKUP($I$2,States,ROW(Table[#This Row])-4,FALSE))","v":0.1},0,null,null,null,1,null,1.2500000000000001E-2,"none",50,null,null,40,0,5000,1000000,73,{"$f":"IF(Premium<50000,0.08,0.1)","v":0.1},{"$f":"IF(Age<=50,IF(Premium<50000,0.07,0.08),\"X\")","v":"X"},{"$f":"IF(Premium<50000,0.08,0.1)","v":0.1},{"$f":"IF(Premium<50000,0.08,0.1)","v":0.1},{"$f":"IF(Premium<50000,0.08,0.1)","v":0.1},{"$f":"IF(Premium<50000,0.08,0.1)","v":0.1},"X","X",{"$f":"IF(Age<=64,IF(Premium<50000,0.07,0.08),\"X\")","v":0.08},{"$f":"IF(Premium<50000,0.08,0.1)","v":0.1},{"$f":"IF(Premium<50000,0.08,0.1)","v":0.1},{"$f":"IF(Premium<50000,0.08,0.1)","v":0.1},{"$f":"IF(Premium<50000,0.07,0.08)","v":0.08},{"$f":"IF(Premium<50000,0.08,0.1)","v":0.1},0.1,0.1,0.1,0.1,0.1,0.1,0.1,0.1,{"$f":"IF(Age<=47,IF(Premium<50000,0.07,0.09),\"X\")","v":"X"},{"$f":"IF(Premium<50000,0.08,0.1)","v":0.1},{"$f":"IF(Premium<50000,0.08,0.1)","v":0.1},{"$f":"IF(Premium<50000,0.08,0.1)","v":0.1},{"$f":"IF(Premium<50000,0.08,0.1)","v":0.1},{"$f":"IF(Age<=50,IF(Premium<50000,0.07,0.08),\"X\")","v":"X"},{"$f":"IF(Premium<50000,0.08,0.1)","v":0.1},{"$f":"IF(Age<=50,IF(Premium<50000,0.07,0.08),\"X\")","v":"X"},{"$f":"IF(Premium<50000,0.08,0.1)","v":0.1},"X",{"$f":"IF(Premium<50000,0.08,0.1)","v":0.1},{"$f":"IF(Premium<50000,0.08,0.1)","v":0.1},{"$f":"IF(Age<=47,IF(Premium<50000,0.07,0.08),\"X\")","v":"X"},{"$f":"IF(Premium<50000,0.08,0.1)","v":0.1},"X",{"$f":"IF(Age<=50,IF(Premium<50000,0.07,0.08),\"X\")","v":"X"},{"$f":"IF(Premium<50000,0.08,0.1)","v":0.1},{"$f":"IF(Age<=50,IF(Premium<50000,0.07,0.08),\"X\")","v":"X"},{"$f":"IF(Premium<50000,0.08,0.1)","v":0.1},{"$f":"IF(Premium<50000,0.08,0.1)","v":0.1},"X",{"$f":"IF(Age<=47,IF(Premium<50000,0.07,0.08),\"X\")","v":"X"},{"$f":"IF(Premium<50000,0.08,0.1)","v":0.1},"X","X",{"$f":"IF(Premium<50000,0.08,0.1)","v":0.1},{"$f":"IF(Premium<50000,0.08,0.1)","v":0.1},{"$f":"IF(Premium<50000,0.08,0.1)","v":0.1},65,{"$f":"IF(Table[[#This Row],[Bonus*]]=\"X\",\"n/a\",Premium)","v":100000},{"$f":"T15S!$A$1","v":8.6580000000000004E-2},{"$f":"IF(OR(Defer<Table[[#This Row],[Required Deferral]],Table[[#This Row],[Bonus*]]=\"X\"),0,Table[[#This Row],[Benefit Base]]*Table[[#This Row],[Single Income Percentage]])","v":8658},{"$f":"T15J!$A$1","v":7.7920000000000003E-2},{"$f":"IF(Table[[#This Row],[Single Annual Income]]=0,0,Table[[#This Row],[Benefit Base]]*Table[[#This Row],[Joint Income Percentage]])","v":7792},"AV",0]
["Athene","B++",null,"Benefit 10",{"$f":"IFERROR(IF(OR(Age<Table[[#This Row],[Min Issue Age]],Age>Table[[#This Row],[Max Issue]]),\"X\",HLOOKUP(State,States,ROW(Table[#This Row])-4,FALSE)),\"X\")","v":0},0.08,0.05,10,"Simple",0,null,1.4E-2,{"$f":"85-Age","v":30},50,6.5000000000000002E-2,5.0000000000000001E-3,30,1,5000,1000000,80,0,0,0,0,"X",0,"X",0,0,0,"X",0,"X",0,0,0,0,0,0,0,0,0,0,0,0,0,0,0,0,0,0,"X",0,0,0,0,0,0,0,0,0,0,0,0,0,0,"X",0,0,0,65,{"$f":"IF(Table[[#This Row],[Bonus*]]=\"X\",\"n/a\",Premium*(1+Table[[#This Row],[Bonus*]])*IF(Table[[#This Row],[Increase Type]]=\"Simple\",1,(1+Table[[#This Row],[Annual Benefit Base Increase Rate]])^MIN(TRUNC(Defer,0),Table[[#This Row],[Rollup Switch]])*(1+Table[[#This Row],[Rollup2]])^MIN(MAX(TRUNC(Defer,0)-Table[[#This Row],[Rollup Switch]],0),Table[[#This Row],[Max Years for Increase]]-Table[[#This Row],[Rollup Switch]]))+IF(Table[[#This Row],[Increase Type]]=\"Simple\",Premium*(1+Table[[#This Row],[Rollup Bonus?]]*Table[[#This Row],[Bonus*]])*(Table[[#This Row],[Annual Benefit Base Increase Rate]]*MIN(TRUNC(Defer,0),Table[[#This Row],[Rollup Switch]])+Table[[#This Row],[Rollup2]]*MIN(MAX(Defer-Table[[#This Row],[Rollup Switch]],0),Table[[#This Row],[Max Years for Increase]]-Table[[#This Row],[Rollup Switch]])),0))","v":180000},{"$f":"IF(Table[[#This Row],[Attained Age]]<Table[[#This Row],[Min Income Age]],0,MIN(FLOOR(Table[[#This Row],[Attained Age]]-20,5)/1000,Table[[#This Row],[Max Payout]]))","v":4.4999999999999998E-2},{"$f":"IF(OR(Defer<Table[[#This Row],[Required Deferral]],Table[[#This Row],[Bonus*]]=\"X\"),0,Table[[#This Row],[Benefit Base]]*Table[[#This Row],[Single Income Percentage]])*(1+IF(Defer<7,0.1,IF(Defer=7,0.05,0)))","v":8100},{"$f":"IF(Table[[#This Row],[Single Income Percentage]]=0,0,Table[[#This Row],[Single Income Percentage]]-Table[[#This Row],[Joint Reduction]])","v":0.04},{"$f":"IF(Table[[#This Row],[Single Annual Income]]=0,0,Table[[#This Row],[Benefit Base]]*Table[[#This Row],[Joint Income Percentage]])*(1+IF(Defer<7,0.1,IF(Defer=7,0.05,0)))","v":7200},"IAV 5-yr",{"$f":"IF(Table[[#This Row],[Benefit Base]]=\"n/a\",0,Table[[#This Row],[Benefit Base]])","v":180000}]
["Aviva LSA","A","A","Income Rider",{"$f":"IF(OR(Age<Table[[#This Row],[Min Issue Age]],Age>Table[[#This Row],[Max Issue]],HLOOKUP(State,States,ROW(Table[#This Row])-4,FALSE)=\"X\"),\"X\",HLOOKUP($I$2,States,ROW(Table[#This Row])-4,FALSE))","v":0.04},{"$f":"IF(Premium>=100000,0.07,0.06)","v":7.0000000000000007E-2},null,null,"Simple",1,null,9.4999999999999998E-3,{"$f":"MAX(MIN(20,85-Age),0)","v":20},50,6.5000000000000002E-2,5.0000000000000001E-3,0,0,25000,1000000,78,{"$f":"IF(Premium>=100000,0.04,0.03)","v":0.04},0.03,{"$f":"IF(Premium>=100000,0.04,0.03)","v":0.04},{"$f":"IF(Premium>=100000,0.04,0.03)","v":0.04},{"$f":"IF(Premium>=100000,0.04,0.03)","v":0.04},{"$f":"IF(Premium>=100000,0.04,0.03)","v":0.04},0.03,0.03,{"$f":"IF(Premium>=100000,0.04,0.03)","v":0.04},0.04,0.04,0.04,0.04,0.04,0.04,0.04,0.04,0.04,0.04,0.04,0.04,0.04,0.03,{"$f":"IF(Premium>=100000,0.04,0.03)","v":0.04},{"$f":"IF(Premium>=100000,0.04,0.03)","v":0.04},{"$f":"IF(Premium>=100000,0.04,0.03)","v":0.04},{"$f":"IF(Premium>=100000,0.04,0.03)","v":0.04},0.03,{"$f":"IF(Premium>=100000,0.04,0.03)","v":0.04},"X",{"$f":"IF(Premium>=100000,0.04,0.03)","v":0.04},"X",{"$f":"IF(Premium>=100000,0.04,0.03)","v":0.04},{"$f":"IF(Premium>=100000,0.04,0.03)","v":0.04},{"$f":"IF(Premium>=100000,0.04,0.03)","v":0.04},{"$f":"IF(Premium>=100000,0.04,0.03)","v":0.04},"X",0.03,{"$f":"IF(Premium>=100000,0.04,0.03)","v":0.04},0.03,{"$f":"IF(Premium>=100000,0.04,0.03)","v":0.04},{"$f":"IF(Premium>=100000,0.04,0.03)","v":0.04},0.03,0.03,{"$f":"IF(Premium>=100000,0.04,0.03)","v":0.04},{"$f":"IF(Premium>=100000,0.04,0.03)","v":0.04},"X",{"$f":"IF(Premium>=100000,0.04,0.03)","v":0.04},{"$f":"IF(Premium>=100000,0.04,0.03)","v":0.04},{"$f":"IF(Premium>=100000,0.04,0.03)","v":0.04},65,{"$f":"IF(Table[[#This Row],[Bonus*]]=\"X\",\"n/a\",Premium*(1+Table[[#This Row],[Bonus*]])*IF(Table[[#This Row],[Increase Type]]=\"Simple\",1,(1+Table[[#This Row],[Annual Benefit Base Increase Rate]])^MIN(Defer,Table[[#This Row],[Max Years for Increase]]))+IF(Table[[#This Row],[Increase Type]]=\"Simple\",Table[[#This Row],[Annual Benefit Base Increase Rate]]*Premium*(1+Table[[#This Row],[Rollup Bonus?]]*Table[[#This Row],[Bonus*]])*MIN(Defer,Table[[#This Row],[Max Years for Increase]]),0))","v":176800},{"$f":"IF(Table[[#This Row],[Attained Age]]<Table[[#This Row],[Min Income Age]],0,IF(Table[[#This Row],[Attained Age]]<55,0.035,IF(Table[[#This Row],[Attained Age]]<60,0.04,IF(Table[[#This Row],[Attained Age]]<65,0.045,IF(Table[[#This Row],[Attained Age]]<70,0.05,IF(Table[[#This Row],[Attained Age]]<75,0.0525,IF(Table[[#This Row],[Attained Age]]<80,0.055,IF(Table[[#This Row],[Attained Age]]<85,0.06,IF(Table[[#This Row],[Attained Age]]<90,0.0625,Table[[#This Row],[Max Payout]])))))))))","v":0.05},{"$f":"IF(OR(Defer<Table[[#This Row],[Required Deferral]],Table[[#This Row],[Bonus*]]=\"X\"),0,Table[[#This Row],[Benefit Base]]*Table[[#This Row],[Single Income Percentage]])","v":8840},{"$f":"IF(Table[[#This Row],[Single Income Percentage]]=0,0,Table[[#This Row],[Single Income Percentage]]-Table[[#This Row],[Joint Reduction]])","v":4.5000000000000005E-2},{"$f":"IF(Table[[#This Row],[Single Annual Income]]=0,0,Table[[#This Row],[Benefit Base]]*Table[[#This Row],[Joint Income Percentage]])","v":7956.0000000000009},"IAV 5-yr",{"$f":"IF(Table[[#This Row],[Benefit Base]]=\"n/a\",0,MIN(Table[[#This Row],[Benefit Base]],Premium*(1+Table[[#This Row],[Bonus*]])*1))","v":104000}]
["EquiTrust","B++","BBB+","Income for Life",{"$f":"IF(OR(Age<Table[[#This Row],[Min Issue Age]],Age>Table[[#This Row],[Max Issue]]),\"X\",IF(Age>=76, 0.06,IF(HLOOKUP(State,States,ROW(Table[#This Row])-4,FALSE)=12%,1.06*1.02^MIN(Defer,3)-1,HLOOKUP(State,States,ROW(Table[#This Row])-4,FALSE))))","v":0.12488048000000007},6.5000000000000002E-2,null,null,null,1,null,7.4999999999999997E-3,15,50,7.4999999999999997E-2,5.0000000000000001E-3,0,2,{"$f":"IF(Table[[#This Row],[Bonus*]]>=0.12,30000,IF(Table[[#This Row],[Bonus*]]=0.1,20000,10000))","v":30000},1000000,80,0.12,0.1,0.12,0.12,0.12,0.12,0.06,0.06,{"$f":"IF(Age<65,12%,6%)","v":0.12},0.12,0.12,0.12,0.12,0.12,0.12,0.12,0.12,0.12,0.12,0.12,0.12,0.12,0.06,0.12,0.12,0.12,0.12,0.06,0.12,0.12,0.12,"X",0.12,0.12,{"$f":"IF(Age<=75,10%,6%)","v":0.1},0.12,0.06,0.12,0.12,0.12,0.12,0.12,0.06,0.06,0.12,0.12,0.06,0.12,0.12,0.12,65,{"$f":"IF(Table[[#This Row],[Bonus*]]=\"X\",\"n/a\",Premium*(1+Table[[#This Row],[Bonus*]])*IF(Table[[#This Row],[Increase Type]]=\"Simple\",1,(1+Table[[#This Row],[Annual Benefit Base Increase Rate]])^MIN(TRUNC(Defer,0),Table[[#This Row],[Max Years for Increase]]))+IF(Table[[#This Row],[Increase Type]]=\"Simple\",Table[[#This Row],[Annual Benefit Base Increase Rate]]*Premium*(1+Table[[#This Row],[Rollup Bonus?]]*Table[[#This Row],[Bonus*]])*MIN(TRUNC(Defer,0),Table[[#This Row],[Max Years for Increase]]),0))","v":211155.52929581798},{"$f":"IF(Table[[#This Row],[Attained Age]]<Table[[#This Row],[Min Income Age]],0,MIN(FLOOR(Table[[#This Row],[Attained Age]]-15,5)/1000,Table[[#This Row],[Max Payout]]))","v":0.05},{"$f":"IF(OR(Defer<Table[[#This Row],[Required Deferral]],Table[[#This Row],[Bonus*]]=\"X\"),0,Table[[#This Row],[Benefit Base]]*Table[[#This Row],[Single Income Percentage]])","v":10557.776464790899},{"$f":"IF(Table[[#This Row],[Single Income Percentage]]=0,0,Table[[#This Row],[Single Income Percentage]]-Table[[#This Row],[Joint Reduction]])","v":4.5000000000000005E-2},{"$f":"IF(Table[[#This Row],[Single Annual Income]]=0,0,Table[[#This Row],[Benefit Base]]*Table[[#This Row],[Joint Income Percentage]])","v":9501.9988183118094},"AV",0]
["F & G","B++","BB","Enhanced Upfront",{"$f":"IF(OR(Age<Table[[#This Row],[Min Issue Age]],Age>Table[[#This Row],[Max Issue]]),\"X\",HLOOKUP(State,States,ROW(Table[#This Row])-4,FALSE))","v":0.03},6.5000000000000002E-2,0.03,10,null,1,null,7.0000000000000001E-3,20,50,0.06,0.01,40,1,10000,1000000,80,0.03,0.03,0.03,0.03,0.03,0.03,0.03,0.03,0.03,0.03,0.03,0.03,0.03,0.03,0.03,0.03,0.03,0.03,0.03,0.03,0.03,0.03,"X",0.03,0.03,0.03,0.03,0.03,0.03,0.03,0.03,"X",0.03,0.03,0.03,"X","X",0.03,0.03,0.03,0.03,0.03,0.03,"X","X",0.03,"X",0.03,0.03,0.03,65,{"$f":"IF(Table[[#This Row],[Bonus*]]=\"X\",\"n/a\",Premium*(1+Table[[#This Row],[Bonus*]])*IF(Table[[#This Row],[Increase Type]]=\"Simple\",1,(1+Table[[#This Row],[Annual Benefit Base Increase Rate]])^MIN(TRUNC(Defer,0),Table[[#This Row],[Rollup Switch]])*(1+Table[[#This Row],[Rollup2]])^MIN(MAX(TRUNC(Defer,0)-Table[[#This Row],[Rollup Switch]],0),Table[[#This Row],[Max Years for Increase]]-Table[[#This Row],[Rollup Switch]]))+IF(Table[[#This Row],[Increase Type]]=\"Simple\",Table[[#This Row],[Annual Benefit Base Increase Rate]]*Premium*(1+Table[[#This Row],[Rollup Bonus?]]*Table[[#This Row],[Bonus*]])*MIN(TRUNC(Defer,0),Table[[#This Row],[Max Years for Increase]]),0))","v":193345.15892274395},{"$f":"IF(Table[[#This Row],[Attained Age]]<Table[[#This Row],[Min Income Age]],0,MIN(FLOOR(Table[[#This Row],[Attained Age]]-15,5)/1000,Table[[#This Row],[Max Payout]]))","v":0.05},{"$f":"IF(OR(Defer<Table[[#This Row],[Required Deferral]],Table[[#This Row],[Bonus*]]=\"X\"),0,Table[[#This Row],[Benefit Base]]*Table[[#This Row],[Single Income Percentage]])","v":9667.2579461371988},{"$f":"IF(Table[[#This Row],[Single Income Percentage]]=0,0,MIN(FLOOR(Table[[#This Row],[Attained Age]]-20,10)/1000,Table[[#This Row],[Max Payout]]))","v":0.04},{"$f":"IF(Table[[#This Row],[Single Annual Income]]=0,0,Table[[#This Row],[Benefit Base]]*Table[[#This Row],[Joint Income Percentage]])","v":7733.8063569097585},"AV",0]
["F & G","B++","BB","Simplicity Elite",{"$f":"IF(OR(Age<Table[[#This Row],[Min Issue Age]],Age>Table[[#This Row],[Max Issue]]),\"X\",HLOOKUP(State,States,ROW(Table[#This Row])-4,FALSE))","v":0},0.1,null,null,"Simple",0,null,1.2500000000000001E-2,10,50,6.5000000000000002E-2,5.0000000000000001E-3,40,1,10000,1000000,85,"X","X",0,0,"X",0,"X","X","X",0,"X",0,"X","X",0,0,0,0,0,"X","X",0,"X","X","X",0,0,0,0,"X",0,"X","X",0,0,"X","X","X",0,0,"X",0,"X",0,0,0,"X",0,"X",0,65,{"$f":"IF(Table[[#This Row],[Bonus*]]=\"X\",\"n/a\",Premium*IF(Table[[#This Row],[Increase Type]]=\"Simple\",1,(1+Table[[#This Row],[Annual Benefit Base Increase Rate]])^MIN(TRUNC(Defer,0),Table[[#This Row],[Max Years for Increase]]))+IF(Table[[#This Row],[Increase Type]]=\"Simple\",Table[[#This Row],[Annual Benefit Base Increase Rate]]*Premium*(1+Table[[#This Row],[Rollup Bonus?]]*Table[[#This Row],[Bonus*]])*MIN(TRUNC(Defer,0),Table[[#This Row],[Max Years for Increase]]),0))","v":200000},{"$f":"IF(Table[[#This Row],[Attained Age]]<Table[[#This Row],[Min Income Age]],0,MIN((Table[[#This Row],[Attained Age]]-17)/1000,Table[[#This Row],[Max Payout]]))","v":4.8000000000000001E-2},{"$f":"IF(OR(Defer<Table[[#This Row],[Required Deferral]],Table[[#This Row],[Bonus*]]=\"X\"),0,Table[[#This Row],[Benefit Base]]*Table[[#This Row],[Single Income Percentage]])","v":9600},{"$f":"IF(Table[[#This Row],[Attained Age]]<Table[[#This Row],[Min Income Age]],0,MIN((Table[[#This Row],[Attained Age]]-22)/1000,Table[[#This Row],[Max Payout]]))","v":4.2999999999999997E-2},{"$f":"IF(Table[[#This Row],[Single Annual Income]]=0,0,Table[[#This Row],[Benefit Base]]*Table[[#This Row],[Joint Income Percentage]])","v":8600},{"$f":"IF(Age<=70,\"IAV 5-yr\",\"IAV 10-yr\")","v":"IAV 5-yr"},{"$f":"IF(Table[[#This Row],[Benefit Base]]=\"n/a\",0,Premium*(1+0.03*MIN(Defer,10)))","v":130000}]
["F & G","B++","BB","New Protection Package",{"$f":"IF(OR(Age<Table[[#This Row],[Min Issue Age]],Age>Table[[#This Row],[Max Issue]],HLOOKUP(State,States,ROW(Table[#This Row])-4,FALSE)=\"X\"),\"X\",HLOOKUP(State,States,ROW(Table[#This Row])-4,FALSE))","v":0.08},7.0000000000000007E-2,0.03,10,null,1,null,1.0999999999999999E-2,20,50,0.06,5.0000000000000001E-3,40,1,10000,1000000,85,"X",7.0000000000000007E-2,0.08,0.08,0.08,0.08,"X",7.0000000000000007E-2,"X",0.08,"X",0.08,"X","X",0.08,0.08,0.08,0.08,0.08,0.08,7.0000000000000007E-2,0.08,"X","X",0.08,0.08,0.08,7.0000000000000007E-2,0.08,0.08,0.08,"X",0.08,0.08,7.0000000000000007E-2,7.0000000000000007E-2,"X",0.08,0.08,7.0000000000000007E-2,"X",0.08,7.0000000000000007E-2,7.0000000000000007E-2,0.08,0.08,"X",0.08,"X",0.08,65,{"$f":"IF(Table[[#This Row],[Bonus*]]=\"X\",\"n/a\",Premium*IF(Table[[#This Row],[Increase Type]]=\"Simple\",1,(1+Table[[#This Row],[Annual Benefit Base Increase Rate]])^MIN(TRUNC(Defer,0),Table[[#This Row],[Rollup Switch]])*(1+Table[[#This Row],[Rollup2]])^MIN(MAX(TRUNC(Defer,0)-Table[[#This Row],[Rollup Switch]],0),Table[[#This Row],[Max Years for Increase]]-Table[[#This Row],[Rollup Switch]]))+IF(Table[[#This Row],[Increase Type]]=\"Simple\",Table[[#This Row],[Annual Benefit Base Increase Rate]]*Premium*(1+Table[[#This Row],[Rollup Bonus?]])*MIN(TRUNC(Defer,0),Table[[#This Row],[Max Years for Increase]]),0))","v":196715.13572895655},{"$f":"IF(Table[[#This Row],[Attained Age]]<Table[[#This Row],[Min Income Age]],0,MIN((Table[[#This Row],[Attained Age]]-17)/1000,Table[[#This Row],[Max Payout]]))","v":4.8000000000000001E-2},{"$f":"IF(OR(Defer<Table[[#This Row],[Required Deferral]],Table[[#This Row],[Bonus*]]=\"X\"),0,Table[[#This Row],[Benefit Base]]*Table[[#This Row],[Single Income Percentage]])","v":9442.3265149899144},{"$f":"IF(Table[[#This Row],[Single Income Percentage]]=0,0,MIN(FLOOR(Table[[#This Row],[Attained Age]]-22,1)/1000,Table[[#This Row],[Max Payout]]))","v":4.2999999999999997E-2},{"$f":"IF(Table[[#This Row],[Single Annual Income]]=0,0,Table[[#This Row],[Benefit Base]]*Table[[#This Row],[Joint Income Percentage]])","v":8458.7508363451307},"Rider",{"$f":"IF(Table[[#This Row],[Benefit Base]]=\"n/a\",0,Premium*(1+Table[[#This Row],[Bonus*]])*(1+0.05*MIN(Defer,85-Age,10)))","v":162000}]
["F & G","B++","BB","Performance Pro",{"$f":"IF(OR(Age<Table[[#This Row],[Min Issue Age]],Age>Table[[#This Row],[Max Issue]],HLOOKUP(State,States,ROW(Table[#This Row])-4,FALSE)=\"X\"),\"X\",HLOOKUP(State,States,ROW(Table[#This Row])-4,FALSE))","v":0},{"$f":"0.04+ror","v":0.04},{"$f":"IF(ror=0,0.02,0.04+ror)","v":0.02},10,null,1,null,9.4999999999999998E-3,20,50,7.2499999999999995E-2,0.01,0,1,10000,1000000,80,"X",0,"x",0,0,0,"X",0,0,0,0,0,0,"X","X",0,0,0,0,0,0,0,"X","X",0,0,0,0,"X",0,0,"X",0,0,0,0,"X","X",0,0,0,0,0,0,"X","X","X",0,0,"X",65,{"$f":"IF(Table[[#This Row],[Bonus*]]=\"X\",\"n/a\",Premium*(1+Table[[#This Row],[Annual Benefit Base Increase Rate]])^MIN(TRUNC(Defer,0),Table[[#This Row],[Rollup Switch]])*(1+Table[[#This Row],[Rollup2]])^MIN(MAX(TRUNC(Defer,0)-Table[[#This Row],[Rollup Switch]],0),Table[[#This Row],[Max Years for Increase]]-Table[[#This Row],[Rollup Switch]]))+IF(Table[[#This Row],[Increase Type]]=\"Simple\",Table[[#This Row],[Annual Benefit Base Increase Rate]]*Premium*(1+Table[[#This Row],[Rollup Bonus?]]*Table[[#This Row],[Bonus*]])*MIN(TRUNC(Defer,0),Table[[#This Row],[Max Years for Increase]]),0)","v":148024.42849183446},{"$f":"IF(Table[[#This Row],[Attained Age]]<Table[[#This Row],[Min Income Age]],0,MIN((FLOOR(Table[[#This Row],[Attained Age]]-15,5)/1000)+0.0025,Table[[#This Row],[Max Payout]]))","v":5.2500000000000005E-2},{"$f":"IF(OR(Defer<Table[[#This Row],[Required Deferral]],Table[[#This Row],[Bonus*]]=\"X\"),0,Table[[#This Row],[Benefit Base]]*Table[[#This Row],[Single Income Percentage]])","v":7771.2824958213105},{"$f":"IF(AND(Table[[#This Row],[Attained Age]]>=Table[[#This Row],[Min Income Age]],Table[[#This Row],[Attained Age]]<60),0.0325,IF(AND(Table[[#This Row],[Attained Age]]>=60,Table[[#This Row],[Attained Age]]<70),0.0425,IF(AND(Table[[#This Row],[Attained Age]]>=70,Table[[#This Row],[Attained Age]]<80),0.0525,0.0625)))","v":4.2500000000000003E-2},{"$f":"IF(Table[[#This Row],[Single Annual Income]]=0,0,Table[[#This Row],[Benefit Base]]*Table[[#This Row],[Joint Income Percentage]])","v":6291.0382109029651},"AV",0]
["F & G","B++","BB","Old Protection Package",{"$f":"IF(OR(Age<Table[[#This Row],[Min Issue Age]],Age>Table[[#This Row],[Max Issue]],HLOOKUP(State,States,ROW(Table[#This Row])-4,FALSE)=\"X\"),\"X\",HLOOKUP(State,States,ROW(Table[#This Row])-4,FALSE))","v":"X"},6.5000000000000002E-2,0.03,10,null,1,null,1.0999999999999999E-2,10,50,0.06,0.01,40,1,10000,1000000,85,"X","X","X","X","X","X","X","X",0.08,"X",0.08,"X",0.08,{"$f":"IF(Age<=80,8%,\"X\")","v":0.08},"X","X","X","X","X","x","X","X","X","X","X","X","X","X","X","X","X","X","X","X","X","X","X","X","X","X",0.08,"X","X","X","X","X","X","X",0.08,"X",65,{"$f":"IF(Table[[#This Row],[Bonus*]]=\"X\",\"n/a\",Premium*MAX(1.18,(1+Table[[#This Row],[Annual Benefit Base Increase Rate]])^MIN(TRUNC(Defer,0),Table[[#This Row],[Max Years for Increase]])))","v":"n/a"},{"$f":"IF(Table[[#This Row],[Attained Age]]<Table[[#This Row],[Min Income Age]],0,MIN(FLOOR(Table[[#This Row],[Attained Age]]-15,5)/1000,Table[[#This Row],[Max Payout]]))","v":0.05},{"$f":"IF(OR(Defer<Table[[#This Row],[Required Deferral]],Table[[#This Row],[Bonus*]]=\"X\"),0,Table[[#This Row],[Benefit Base]]*Table[[#This Row],[Single Income Percentage]])","v":0},{"$f":"IF(Table[[#This Row],[Single Income Percentage]]=0,0,MIN(FLOOR(Table[[#This Row],[Attained Age]]-20,10)/1000,Table[[#This Row],[Max Payout]]))","v":0.04},{"$f":"IF(Table[[#This Row],[Single Annual Income]]=0,0,Table[[#This Row],[Benefit Base]]*Table[[#This Row],[Joint Income Percentage]])","v":0},{"$f":"IF(Age<=70,\"IAV 5-yr\",\"IAV 10-yr\")","v":"IAV 5-yr"},{"$f":"IF(Table[[#This Row],[Benefit Base]]=\"n/a\",0,MIN(Table[[#This Row],[Benefit Base]],Premium*(1+Table[[#This Row],[Bonus*]])*2))","v":0}]
["Forethought","A-","A-","Index Bonus 115",{"$f":"IF(OR(Age<Table[[#This Row],[Min Issue Age]],Age>Table[[#This Row],[Max Issue]]),\"X\",HLOOKUP(State,States,ROW(Table[#This Row])-4,FALSE))","v":0.15},0.06,null,null,null,1,null,9.4999999999999998E-3,10,59,6.5000000000000002E-2,0.01,40,1,10000,1000000,85,0.15,0.15,0.15,0.15,0.15,0.15,0.15,0.15,0.15,0.15,0.15,0.15,0.15,0.15,0.15,0.15,0.15,0.15,0.15,0.15,0.15,0.15,0.15,0.15,0.15,0.15,0.15,0.15,0.15,0.15,0.15,"X",0.15,0.15,0.15,0.15,0.15,0.15,0.15,0.15,0.15,0.15,0.15,0.15,0.15,0.15,0.15,0.15,0.15,0.15,65,{"$f":"IF(Table[[#This Row],[Bonus*]]=\"X\",\"n/a\",Premium*(1+Table[[#This Row],[Bonus*]])*IF(Table[[#This Row],[Increase Type]]=\"Simple\",1,(1+Table[[#This Row],[Annual Benefit Base Increase Rate]])^MIN(TRUNC(Defer,0),Table[[#This Row],[Max Years for Increase]]))+IF(Table[[#This Row],[Increase Type]]=\"Simple\",Table[[#This Row],[Annual Benefit Base Increase Rate]]*Premium*(1+Table[[#This Row],[Rollup Bonus?]]*Table[[#This Row],[Bonus*]])*MIN(TRUNC(Defer,0),Table[[#This Row],[Max Years for Increase]]),0))","v":205947.48510242824},{"$f":"IF(Table[[#This Row],[Attained Age]]<Table[[#This Row],[Min Income Age]], 0, IF(Table[[#This Row],[Attained Age]]<71,0.045,IF(Table[[#This Row],[Attained Age]]<81,0.055,Table[[#This Row],[Max Payout]])))","v":4.4999999999999998E-2},{"$f":"IF(OR(Defer<Table[[#This Row],[Required Deferral]],Table[[#This Row],[Bonus*]]=\"X\"),0,Table[[#This Row],[Benefit Base]]*Table[[#This Row],[Single Income Percentage]])","v":9267.6368296092696},{"$f":"IF(Table[[#This Row],[Single Income Percentage]]=0,0,Table[[#This Row],[Single Income Percentage]]-Table[[#This Row],[Joint Reduction]])","v":3.4999999999999996E-2},{"$f":"IF(Table[[#This Row],[Single Annual Income]]=0,0,Table[[#This Row],[Benefit Base]]*Table[[#This Row],[Joint Income Percentage]])","v":7208.161978584988},"Rider",{"$f":"IF(OR(Table[[#This Row],[Benefit Base]]=\"n/a\",Age>75),0,MIN(Premium*(1+0.05*MIN(TRUNC(Defer,0),85-Age)),Premium*2))","v":150000}]
["Forethought","A-","A-","Income 125",{"$f":"IF(OR(Age<Table[[#This Row],[Min Issue Age]],Age>Table[[#This Row],[Max Issue]]),\"X\",HLOOKUP(State,States,ROW(Table[#This Row])-4,FALSE))","v":0.25},0.05,null,null,null,1,null,5.4999999999999997E-3,10,59,5.5E-2,0.01,40,0,10000,1000000,85,0.25,0.25,0.25,0.25,0.25,0.25,0.25,0.25,0.25,0.25,0.25,0.25,0.25,0.25,0.25,0.25,0.25,0.25,0.25,0.25,0.25,0.25,0.25,0.25,0.25,0.25,0.25,0.25,0.25,0.25,0.25,"X",0.25,0.25,0.25,0.25,0.25,0.25,0.25,0.25,0.25,0.25,0.25,0.25,0.25,0.25,0.25,0.25,0.25,0.25,{"$f":"Age+Defer","v":65},{"$f":"IF(Table[[#This Row],[Bonus*]]=\"X\",\"n/a\",Premium*(1+Table[[#This Row],[Bonus*]])*IF(Table[[#This Row],[Increase Type]]=\"Simple\",1,(1+Table[[#This Row],[Annual Benefit Base Increase Rate]])^MIN(TRUNC(Defer,0),Table[[#This Row],[Max Years for Increase]]))+IF(Table[[#This Row],[Increase Type]]=\"Simple\",Table[[#This Row],[Annual Benefit Base Increase Rate]]*Premium*(1+Table[[#This Row],[Rollup Bonus?]]*Table[[#This Row],[Bonus*]])*MIN(TRUNC(Defer,0),Table[[#This Row],[Max Years for Increase]]),0))","v":203611.82834718018},{"$f":"IF(Table[[#This Row],[Attained Age]]<Table[[#This Row],[Min Income Age]], 0, IF(Table[[#This Row],[Attained Age]]<76,0.045,IF(Table[[#This Row],[Attained Age]]<81,0.055,Table[[#This Row],[Max Payout]])))","v":4.4999999999999998E-2},{"$f":"IF(OR(Defer<Table[[#This Row],[Required Deferral]],Table[[#This Row],[Bonus*]]=\"X\"),0,Table[[#This Row],[Benefit Base]]*Table[[#This Row],[Single Income Percentage]])","v":9162.5322756231071},{"$f":"IF(Table[[#This Row],[Single Income Percentage]]=0,0,Table[[#This Row],[Single Income Percentage]]-Table[[#This Row],[Joint Reduction]])","v":3.4999999999999996E-2},{"$f":"IF(Table[[#This Row],[Single Annual Income]]=0,0,Table[[#This Row],[Benefit Base]]*Table[[#This Row],[Joint Income Percentage]])","v":7126.413992151306},"Rider",{"$f":"IF(OR(Table[[#This Row],[Benefit Base]]=\"n/a\",Age>75),0,MIN(Premium*(1+0.05*MIN(TRUNC(Defer,0),85-Age)),Premium*1.5))","v":150000}]
["Forethought","A-","A-","GLIB ForeFront Series",{"$f":"IF(OR(Age<Table[[#This Row],[Min Issue Age]],Age>Table[[#This Row],[Max Issue]],HLOOKUP(State,States,ROW(Table[#This Row])-4,FALSE)=\"X\"),\"X\",HLOOKUP(State,States,ROW(Table[#This Row])-4,FALSE))","v":0.06},0.05,null,null,null,null,null,9.4999999999999998E-3,20,55,0.08,5.0000000000000001E-3,0,null,null,null,80,{"$f":"IF(Age<55,0,0.06)","v":0.06},0.06,0.06,0.06,0.06,0.06,0.06,0.06,0.06,0.06,0.06,0.06,0.06,0.05,{"$f":"IF(Age<55,0,0.06)","v":0.06},0.06,0.06,0.06,0.06,0.06,0.06,0.06,0.06,0.06,0.06,0.06,0.06,0.06,0.06,0.06,0.06,"X",{"$f":"IF(Age<55,0,0.06)","v":0.06},0.06,0.06,0.06,0.06,0.06,0.06,0.06,0.06,0.06,0.06,0.06,0.06,0.06,0.06,0.06,0.06,0.06,65,{"$f":"IF(Table[[#This Row],[Bonus*]]=\"X\",\"n/a\",Premium*(1+Table[[#This Row],[Bonus*]])*IF(Table[[#This Row],[Increase Type]]=\"Simple\",1,(1+Table[[#This Row],[Annual Benefit Base Increase Rate]])^MIN(TRUNC(Defer,0),Table[[#This Row],[Max Years for Increase]]))+IF(Table[[#This Row],[Increase Type]]=\"Simple\",Table[[#This Row],[Annual Benefit Base Increase Rate]]*Premium*(1+Table[[#This Row],[Rollup Bonus?]]*Table[[#This Row],[Bonus*]])*MIN(TRUNC(Defer,0),Table[[#This Row],[Max Years for Increase]]),0))","v":172662.8304384088},{"$f":"IF(Table[[#This Row],[Attained Age]]<Table[[#This Row],[Min Income Age]],0,MIN(FLOOR(Table[[#This Row],[Attained Age]]-20,1)/1000,Table[[#This Row],[Max Payout]]))","v":4.4999999999999998E-2},{"$f":"IF(OR(Defer<Table[[#This Row],[Required Deferral]],Table[[#This Row],[Bonus*]]=\"X\"),0,Table[[#This Row],[Benefit Base]]*Table[[#This Row],[Single Income Percentage]])","v":7769.8273697283958},{"$f":"IF(Table[[#This Row],[Single Income Percentage]]=0,0,Table[[#This Row],[Single Income Percentage]]-Table[[#This Row],[Joint Reduction]])","v":0.04},{"$f":"IF(Table[[#This Row],[Single Annual Income]]=0,0,Table[[#This Row],[Benefit Base]]*Table[[#This Row],[Joint Income Percentage]])","v":6906.5132175363524},"AV",0]
["Forethought","A-","A-","Income 150+",{"$f":"IF(OR(Age<Table[[#This Row],[Min Issue Age]],Age>Table[[#This Row],[Max Issue]]),\"X\",HLOOKUP(State,States,ROW(Table[#This Row])-4,FALSE))","v":0.5},{"$f":"ror*1.5","v":0},null,null,null,1,null,9.4999999999999998E-3,9,55,7.8E-2,5.0000000000000001E-3,55,0,10000,1000000,80,{"$f":"IF(Defer<3,20%,IF(Defer<5,35%,50%))","v":0.5},0.5,0.5,0.5,0.5,0.5,0.5,0.5,0.5,0.5,0.5,0.5,0.5,0.5,0.5,0.5,0.5,0.5,0.5,0.5,0.5,0.5,0.5,0.5,0.5,0.5,0.5,0.5,0.5,"X",{"$f":"IF(Defer<3,20%,IF(Defer<5,35%,50%))","v":0.5},"X",{"$f":"IF(Defer<3,20%,IF(Defer<5,35%,50%))","v":0.5},0.5,0.5,0.5,0.5,0.5,0.5,0.5,0.5,0.5,0.5,0.5,0.5,0.5,0.5,0.5,0.5,0.5,65,{"$f":"IF(Table[[#This Row],[Bonus*]]=\"X\",\"n/a\",MIN((IF(Defer<9,Premium*(1+Table[[#This Row],[Bonus*]]),((1+Table[[#This Row],[Bonus*]])*Premium)*(1+Table[[#This Row],[Annual Benefit Base Increase Rate]])^Defer)),Premium*2.5))","v":150000},{"$f":"IF(Table[[#This Row],[Attained Age]]<Table[[#This Row],[Min Income Age]],0,IF(Table[[#This Row],[Attained Age]]=55,0.04,IF(Table[[#This Row],[Attained Age]]<58,0.041,IF(Table[[#This Row],[Attained Age]]<60,0.042,MIN((FLOOR(Table[[#This Row],[Attained Age]]-17,1)+0)/1000,Table[[#This Row],[Max Payout]])))))","v":4.8000000000000001E-2},{"$f":"IF(OR(Defer<Table[[#This Row],[Required Deferral]],Table[[#This Row],[Bonus*]]=\"X\"),0,Table[[#This Row],[Benefit Base]]*Table[[#This Row],[Single Income Percentage]])","v":7200},{"$f":"IF(Table[[#This Row],[Single Income Percentage]]=0,0,Table[[#This Row],[Single Income Percentage]]-Table[[#This Row],[Joint Reduction]])","v":4.3000000000000003E-2},{"$f":"IF(Table[[#This Row],[Single Annual Income]]=0,0,Table[[#This Row],[Benefit Base]]*Table[[#This Row],[Joint Income Percentage]])","v":6450.0000000000009},"AV",0]
["Forethought","A-","A-","Bonus Advantage GLAI",{"$f":"IF(OR(Age<Table[[#This Row],[Min Issue Age]],Age>Table[[#This Row],[Max Issue]],HLOOKUP(State,States,ROW(Table[#This Row])-4,FALSE)=\"X\"),\"X\",HLOOKUP(State,States,ROW(Table[#This Row])-4,FALSE))","v":0.05},0.05,null,null,null,1,null,9.4999999999999998E-3,{"$f":"MAX(MIN(IF(FLOOR(Age,5)<>FLOOR(Age,10),84-Age,80-FLOOR(Age,10)),20),5)","v":20},55,7.0000000000000007E-2,5.0000000000000001E-3,55,1,10000,1000000,80,0.05,0.05,0.05,0.05,0.05,0.05,"X",0.05,0.05,0.05,0.05,0.05,0.05,0.05,0.05,0.05,0.05,0.05,0.05,0.05,0.05,0.05,0.05,0.05,0.05,0.05,0.05,0.05,0.05,0.05,0.05,"X",0.05,0.05,0.05,0.05,0.05,0.05,0.05,0.05,0.05,0.05,0.05,0.05,0.05,0.05,0.05,0.05,0.05,0.05,65,{"$f":"IF(Table[[#This Row],[Bonus*]]=\"X\",\"n/a\",Premium*(1+Table[[#This Row],[Bonus*]])*IF(Table[[#This Row],[Increase Type]]=\"Simple\",1,(1+Table[[#This Row],[Annual Benefit Base Increase Rate]])^MIN(TRUNC(Defer,0),Table[[#This Row],[Max Years for Increase]]))+IF(Table[[#This Row],[Increase Type]]=\"Simple\",Table[[#This Row],[Annual Benefit Base Increase Rate]]*Premium*(1+Table[[#This Row],[Rollup Bonus?]]*Table[[#This Row],[Bonus*]])*MIN(TRUNC(Defer,0),Table[[#This Row],[Max Years for Increase]]),0))","v":171033.93581163135},{"$f":"IF(Table[[#This Row],[Attained Age]]<Table[[#This Row],[Min Income Age]],0,MIN(FLOOR(Table[[#This Row],[Attained Age]]-25,1)/1000,Table[[#This Row],[Max Payout]]))","v":0.04},{"$f":"IF(OR(Defer<Table[[#This Row],[Required Deferral]],Table[[#This Row],[Bonus*]]=\"X\"),0,Table[[#This Row],[Benefit Base]]*Table[[#This Row],[Single Income Percentage]])","v":6841.3574324652545},{"$f":"IF(Table[[#This Row],[Single Income Percentage]]=0,0,Table[[#This Row],[Single Income Percentage]]-Table[[#This Row],[Joint Reduction]])","v":3.5000000000000003E-2},{"$f":"IF(Table[[#This Row],[Single Annual Income]]=0,0,Table[[#This Row],[Benefit Base]]*Table[[#This Row],[Joint Income Percentage]])","v":5986.1877534070982},"IAV 5-yr",{"$f":"IF(Table[[#This Row],[Benefit Base]]=\"n/a\",0,MIN(Table[[#This Row],[Benefit Base]],Premium*2.5))","v":171033.93581163135}]
["Genworth","A","A","Income Protector",{"$f":"IF(OR(Age<Table[[#This Row],[Min Issue Age]],Age>Table[[#This Row],[Max Issue]]),\"X\",HLOOKUP(State,States,ROW(Table[#This Row])-4,FALSE))","v":0.06},0.08,null,null,"Simple",1,null,8.0000000000000002E-3,10,55,6.5000000000000002E-2,5.0000000000000001E-3,55,1,25000,1000000,80,0.06,0.06,0.06,0.06,0.06,0.06,0,"X",0.06,0.06,0.06,0.06,0.06,0.06,0.06,0.06,0.06,0.06,0.06,0.06,0.06,0.06,0.06,0.06,0.06,0.06,0.06,0.06,0.06,0.06,0.06,"X",0.06,0.06,0.06,0.06,0.06,0.06,0.06,0.06,0.06,0.06,0.06,0.06,0.06,0.06,0.06,0.06,0.06,0.06,65,{"$f":"IF(Table[[#This Row],[Bonus*]]=\"X\",\"n/a\",Premium*(1+Table[[#This Row],[Bonus*]])*IF(Table[[#This Row],[Increase Type]]=\"Simple\",1,(1+Table[[#This Row],[Annual Benefit Base Increase Rate]])^MIN(Defer,Table[[#This Row],[Max Years for Increase]]))+IF(Table[[#This Row],[Increase Type]]=\"Simple\",Table[[#This Row],[Annual Benefit Base Increase Rate]]*Premium*(1+Table[[#This Row],[Rollup Bonus?]]*Table[[#This Row],[Bonus*]])*MIN(Defer,Table[[#This Row],[Max Years for Increase]]),0))","v":190800},{"$f":"IF(Table[[#This Row],[Attained Age]]<Table[[#This Row],[Min Income Age]],0,IF(Table[[#This Row],[Attained Age]]<60,0.04,IF(Table[[#This Row],[Attained Age]]<65,0.045,IF(Table[[#This Row],[Attained Age]]<70,0.05,IF(Table[[#This Row],[Attained Age]]<75,0.055,IF(Table[[#This Row],[Attained Age]]<80,0.06,Table[[#This Row],[Max Payout]]))))))","v":0.05},{"$f":"IF(OR(Defer<Table[[#This Row],[Required Deferral]],Table[[#This Row],[Bonus*]]=\"X\"),0,Table[[#This Row],[Benefit Base]]*Table[[#This Row],[Single Income Percentage]])","v":9540},{"$f":"IF(Table[[#This Row],[Single Income Percentage]]=0,0,Table[[#This Row],[Single Income Percentage]]-Table[[#This Row],[Joint Reduction]])","v":4.5000000000000005E-2},{"$f":"IF(Table[[#This Row],[Single Annual Income]]=0,0,Table[[#This Row],[Benefit Base]]*Table[[#This Row],[Joint Income Percentage]])","v":8586.0000000000018},"AV",0]
["Great American Life®2","A","A+","IncomeSecure®",{"$f":"IF(OR(Age<Table[[#This Row],[Min Issue Age]],Age>Table[[#This Row],[Max Issue]]),\"X\",HLOOKUP(State,States,ROW(Table[#This Row])-4,FALSE))","v":0.02},0.1,null,null,"Simple",1,null,8.5000000000000006E-3,10,55,7.4999999999999997E-2,0.01,40,0,10000,1000000,85,0.02,0.02,0.02,0.02,0.02,0.02,0.02,0.02,0.02,0.02,0.02,0.02,0.02,0.02,0.02,0.02,0.02,0.02,0.02,0.02,0.02,0.02,0.02,0.02,0.02,0.02,0.02,0.02,0.02,0.02,0.02,"X",0.02,0.02,0.02,0.02,0.02,0.02,0.02,0.02,0.02,0.02,0.02,0.02,0.02,0.02,0.02,0.02,0.02,0.02,65,{"$f":"IF(Table[[#This Row],[Bonus*]]=\"X\",\"n/a\",Premium*(1+Table[[#This Row],[Bonus*]])*IF(Table[[#This Row],[Increase Type]]=\"Simple\",1,(1+Table[[#This Row],[Annual Benefit Base Increase Rate]])^MIN(TRUNC(Defer,0),Table[[#This Row],[Max Years for Increase]]))+IF(Table[[#This Row],[Increase Type]]=\"Simple\",Table[[#This Row],[Annual Benefit Base Increase Rate]]*Premium*(1+Table[[#This Row],[Rollup Bonus?]]*Table[[#This Row],[Bonus*]])*MIN(TRUNC(Defer,0),Table[[#This Row],[Max Years for Increase]]),0))","v":204000},{"$f":"IF(Table[[#This Row],[Attained Age]]<Table[[#This Row],[Min Income Age]],0,MIN((Table[[#This Row],[Attained Age]]-15)/1000,Table[[#This Row],[Max Payout]]))","v":0.05},{"$f":"IF(OR(Defer<Table[[#This Row],[Required Deferral]],Table[[#This Row],[Bonus*]]=\"X\"),0,Table[[#This Row],[Benefit Base]]*Table[[#This Row],[Single Income Percentage]])","v":10200},{"$f":"IF(Table[[#This Row],[Single Income Percentage]]=0,0,Table[[#This Row],[Single Income Percentage]]-Table[[#This Row],[Joint Reduction]])","v":0.04},{"$f":"IF(Table[[#This Row],[Single Annual Income]]=0,0,Table[[#This Row],[Benefit Base]]*Table[[#This Row],[Joint Income Percentage]])","v":8160},"AV",0]
["Great American Life®2","A","A+","IncomeSustainer Plus®",{"$f":"IF(OR(Age<Table[[#This Row],[Min Issue Age]],Age>Table[[#This Row],[Max Issue]]),\"X\",HLOOKUP(State,States,ROW(Table[#This Row])-4,FALSE))","v":0.02},0.08,null,null,"Simple",1,null,1.2500000000000001E-2,12,55,7.4999999999999997E-2,0.01,50,1,10000,1000000,85,0.02,0.02,0.02,0.02,0.02,0.02,0.02,0.02,0.02,0.02,0.02,0.02,0.02,0.02,0.02,0.02,0.02,0.02,0.02,0.02,0.02,0.02,0.02,0.02,0.02,0.02,0.02,0.02,0.02,0.02,0.02,"X",0.02,0.02,0.02,0.02,0.02,0.02,0.02,0.02,0.02,0.02,0.02,0.02,0.02,0.02,0.02,0.02,0.02,0.02,65,{"$f":"IF(Table[[#This Row],[Bonus*]]=\"X\",\"n/a\",Premium*(1+Table[[#This Row],[Bonus*]])*IF(Table[[#This Row],[Increase Type]]=\"Simple\",1,(1+Table[[#This Row],[Annual Benefit Base Increase Rate]])^MIN(TRUNC(Defer,0),Table[[#This Row],[Max Years for Increase]]))+IF(Table[[#This Row],[Increase Type]]=\"Simple\",Table[[#This Row],[Annual Benefit Base Increase Rate]]*Premium*(1+Table[[#This Row],[Rollup Bonus?]]*Table[[#This Row],[Bonus*]])*MIN(TRUNC(Defer,0),Table[[#This Row],[Max Years for Increase]]),0))","v":183600},{"$f":"IF(Table[[#This Row],[Attained Age]]<Table[[#This Row],[Min Income Age]],0,MIN((Table[[#This Row],[Attained Age]]-15)/1000,Table[[#This Row],[Max Payout]]))","v":0.05},{"$f":"IF(OR(Defer<Table[[#This Row],[Required Deferral]],Table[[#This Row],[Bonus*]]=\"X\"),0,Table[[#This Row],[Benefit Base]]*Table[[#This Row],[Single Income Percentage]])","v":9180},{"$f":"IF(Table[[#This Row],[Single Income Percentage]]=0,0,Table[[#This Row],[Single Income Percentage]]-Table[[#This Row],[Joint Reduction]])","v":0.04},{"$f":"IF(Table[[#This Row],[Single Annual Income]]=0,0,Table[[#This Row],[Benefit Base]]*Table[[#This Row],[Joint Income Percentage]])","v":7344},"IAV 5-yr",{"$f":"IF(Table[[#This Row],[Benefit Base]]=\"n/a\",0,IF(TRUNC(Defer,0)<5,Premium*(1+Table[[#This Row],[Bonus*]]),MIN(Table[[#This Row],[Benefit Base]],Premium*(1+Table[[#This Row],[Bonus*]])*2)))","v":183600}]
["Great American Life®2","A","A+","Inheritance Enhancer®",{"$f":"IF(OR(Age<Table[[#This Row],[Min Issue Age]],Age>Table[[#This Row],[Max Issue]]),\"X\",HLOOKUP(State,States,ROW(Table[#This Row])-4,FALSE))","v":0.02},0.09,null,null,"Simple",1,null,8.5000000000000006E-3,10,999,0,0,50,5,10000,1000000,85,0.02,0.02,0.02,0.02,0.02,0.02,0.02,0.02,0.02,0.02,0.02,0.02,0.02,0.02,0.02,0.02,0.02,0.02,0.02,0.02,0.02,0.02,0.02,0.02,0.02,0.02,0.02,0.02,0.02,0.02,0.02,"X",0.02,0.02,0.02,0.02,"X",0.02,0.02,0.02,0.02,0.02,0.02,0.02,0.02,0.02,"X",0.02,0.02,0.02,65,{"$f":"IF(Table[[#This Row],[Bonus*]]=\"X\",\"n/a\",Premium*(1+Table[[#This Row],[Bonus*]])*IF(Table[[#This Row],[Increase Type]]=\"Simple\",1,(1+Table[[#This Row],[Annual Benefit Base Increase Rate]])^MIN(TRUNC(Defer,0),Table[[#This Row],[Max Years for Increase]]))+IF(Table[[#This Row],[Increase Type]]=\"Simple\",Table[[#This Row],[Annual Benefit Base Increase Rate]]*Premium*(1+Table[[#This Row],[Rollup Bonus?]]*Table[[#This Row],[Bonus*]])*MIN(TRUNC(Defer,0),Table[[#This Row],[Max Years for Increase]]),0))","v":193800},{"$f":"IF(Table[[#This Row],[Attained Age]]<Table[[#This Row],[Min Income Age]],0,MIN((Table[[#This Row],[Attained Age]]-15)/1000,Table[[#This Row],[Max Payout]]))","v":0},{"$f":"IF(OR(Defer<Table[[#This Row],[Required Deferral]],Table[[#This Row],[Bonus*]]=\"X\"),0,Table[[#This Row],[Benefit Base]]*Table[[#This Row],[Single Income Percentage]])","v":0},{"$f":"IF(Table[[#This Row],[Single Income Percentage]]=0,0,Table[[#This Row],[Single Income Percentage]]-Table[[#This Row],[Joint Reduction]])","v":0},{"$f":"IF(Table[[#This Row],[Single Annual Income]]=0,0,Table[[#This Row],[Benefit Base]]*Table[[#This Row],[Joint Income Percentage]])","v":0},"IAV 5-yr",{"$f":"IF(Table[[#This Row],[Benefit Base]]=\"n/a\",0,IF(TRUNC(Defer,0)<5,Premium*(1+Table[[#This Row],[Bonus*]]),MIN(Table[[#This Row],[Benefit Base]],Premium*(1+Table[[#This Row],[Bonus*]])*2.5)))","v":193800}]
["ING","A","A-","Income Protector",{"$f":"IF(OR(Age<Table[[#This Row],[Min Issue Age]],Age>Table[[#This Row],[Max Issue]]),\"X\",HLOOKUP(State,States,ROW(Table[#This Row])-4,FALSE))","v":0.05},0.06,null,null,null,1,null,6.4999999999999997E-3,10,50,7.0000000000000007E-2,5.0000000000000001E-3,50,0,15000,1000000,80,0.05,0,0.05,0.05,0.05,0.05,0,0,0.05,0.05,0.05,0.05,0.05,0.05,0.05,0.05,0.05,0.05,0.05,0.05,0.05,0.05,0,0.05,0.05,0.05,0.05,0.05,0.05,"X",0.05,"X",0.05,0.05,0.05,0.05,"X",0.05,0.05,0.05,0.05,0.05,0.05,0.05,0.05,0.05,0.05,0.05,0.05,0.05,65,{"$f":"IF(Table[[#This Row],[Bonus*]]=\"X\",\"n/a\",Premium*(1+Table[[#This Row],[Bonus*]])*IF(Table[[#This Row],[Increase Type]]=\"Simple\",1,(1+Table[[#This Row],[Annual Benefit Base Increase Rate]])^MIN(TRUNC(Defer,0),Table[[#This Row],[Max Years for Increase]]))+IF(Table[[#This Row],[Increase Type]]=\"Simple\",Table[[#This Row],[Annual Benefit Base Increase Rate]]*Premium*(1+Table[[#This Row],[Rollup Bonus?]]*Table[[#This Row],[Bonus*]])*MIN(TRUNC(Defer,0),Table[[#This Row],[Max Years for Increase]]),0))","v":188039.00813699974},{"$f":"IF(Table[[#This Row],[Attained Age]]<Table[[#This Row],[Min Income Age]],0,IF(Table[[#This Row],[Attained Age]]<65,0.04,MIN(FLOOR(Table[[#This Row],[Attained Age]]-15,10)/1000,Table[[#This Row],[Max Payout]])))","v":0.05},{"$f":"IF(OR(Defer<Table[[#This Row],[Required Deferral]],Table[[#This Row],[Bonus*]]=\"X\"),0,Table[[#This Row],[Benefit Base]]*Table[[#This Row],[Single Income Percentage]])","v":9401.9504068499864},{"$f":"IF(Table[[#This Row],[Single Income Percentage]]=0,0,Table[[#This Row],[Single Income Percentage]]-Table[[#This Row],[Joint Reduction]])","v":4.5000000000000005E-2},{"$f":"IF(Table[[#This Row],[Single Annual Income]]=0,0,Table[[#This Row],[Benefit Base]]*Table[[#This Row],[Joint Income Percentage]])","v":8461.755366164989},"AV",0]
["Lincoln","A+","AA-","OptiChoice",{"$f":"IF(OR(Age<Table[[#This Row],[Min Issue Age]],Age>Table[[#This Row],[Max Issue]]),\"X\",HLOOKUP(State,States,ROW(Table[#This Row])-4,FALSE))","v":0},0.05,null,null,null,1,null,9.4999999999999998E-3,10,50,7.7499999999999999E-2,7.4999999999999997E-3,40,0,5000,1000000,85,0,0,0,0,0,0,0,0,0,0,0,0,0,0,0,0,0,0,0,0,0,0,0,0,0,0,0,0,0,0,0,"X",0,0,0,0,0,0,0,0,0,0,0,0,0,0,"X",0,0,0,65,{"$f":"IF(Table[[#This Row],[Bonus*]]=\"X\",\"n/a\",Premium*(1+Table[[#This Row],[Bonus*]])*IF(Table[[#This Row],[Increase Type]]=\"Simple\",1,(1+Table[[#This Row],[Annual Benefit Base Increase Rate]])^MIN(TRUNC(Defer,0),Table[[#This Row],[Max Years for Increase]]))+IF(Table[[#This Row],[Increase Type]]=\"Simple\",Table[[#This Row],[Annual Benefit Base Increase Rate]]*Premium*(1+Table[[#This Row],[Rollup Bonus?]]*Table[[#This Row],[Bonus*]])*MIN(TRUNC(Defer,0),Table[[#This Row],[Max Years for Increase]]),0))","v":162889.46267774416},{"$f":"IF(Table[[#This Row],[Attained Age]]<Table[[#This Row],[Min Income Age]],0,MIN((FLOOR(Table[[#This Row],[Attained Age]]-20,5)+5)/1000,Table[[#This Row],[Max Payout]]))+IF(Defer>=5,0.0075,0)+IF(Defer>=10,0.005,0)","v":6.25E-2},{"$f":"IF(OR(Defer<Table[[#This Row],[Required Deferral]],Table[[#This Row],[Bonus*]]=\"X\"),0,Table[[#This Row],[Benefit Base]]*Table[[#This Row],[Single Income Percentage]])","v":10180.59141735901},{"$f":"IF(Table[[#This Row],[Single Income Percentage]]=0,0,Table[[#This Row],[Single Income Percentage]]-Table[[#This Row],[Joint Reduction]])","v":5.5E-2},{"$f":"IF(Table[[#This Row],[Single Annual Income]]=0,0,Table[[#This Row],[Benefit Base]]*Table[[#This Row],[Joint Income Percentage]])","v":8958.9204472759284},"AV",0]
["Lincoln","A+","AA-","OptiPoint",{"$f":"IF(OR(Age<Table[[#This Row],[Min Issue Age]],Age>Table[[#This Row],[Max Issue]]),\"X\",IFERROR(HLOOKUP(State,States,ROW(Table[#This Row])-4,FALSE)-IF(Premium<100000,0.01,0),\"X\"))","v":0.04},0.05,null,null,null,1,null,9.4999999999999998E-3,10,50,7.7499999999999999E-2,7.4999999999999997E-3,40,0,5000,1000000,80,0.04,0.03,0.04,0.04,0.04,0.04,0.04,0.04,0.04,0.04,0.04,0.04,0.04,0.04,0.04,0.04,0.04,0.04,0.04,0.04,0.04,0.04,"X",0.04,0.04,0.04,0.04,0.04,0.04,0.04,0.04,"X",0.04,0.04,0.04,0.04,"X",0.04,0.04,0.04,0.04,0.04,0.04,"X",0.04,0.04,"X",0.04,0.04,0.04,65,{"$f":"IF(Table[[#This Row],[Bonus*]]=\"X\",\"n/a\",Premium*(1+Table[[#This Row],[Bonus*]])*IF(Table[[#This Row],[Increase Type]]=\"Simple\",1,(1+Table[[#This Row],[Annual Benefit Base Increase Rate]])^MIN(TRUNC(Defer,0),Table[[#This Row],[Max Years for Increase]]))+IF(Table[[#This Row],[Increase Type]]=\"Simple\",Table[[#This Row],[Annual Benefit Base Increase Rate]]*Premium*(1+Table[[#This Row],[Rollup Bonus?]]*Table[[#This Row],[Bonus*]])*MIN(TRUNC(Defer,0),Table[[#This Row],[Max Years for Increase]]),0))","v":169405.04118485394},{"$f":"IF(Table[[#This Row],[Attained Age]]<Table[[#This Row],[Min Income Age]],0,MIN((FLOOR(Table[[#This Row],[Attained Age]]-20,5)+5)/1000,Table[[#This Row],[Max Payout]]))+IF(Defer>=5,0.005,0)+IF(Defer>=10,0.0035,0)","v":5.8500000000000003E-2},{"$f":"IF(OR(Defer<Table[[#This Row],[Required Deferral]],Table[[#This Row],[Bonus*]]=\"X\"),0,Table[[#This Row],[Benefit Base]]*Table[[#This Row],[Single Income Percentage]])","v":9910.1949093139556},{"$f":"IF(Table[[#This Row],[Single Income Percentage]]=0,0,Table[[#This Row],[Single Income Percentage]]-Table[[#This Row],[Joint Reduction]])","v":5.1000000000000004E-2},{"$f":"IF(Table[[#This Row],[Single Annual Income]]=0,0,Table[[#This Row],[Benefit Base]]*Table[[#This Row],[Joint Income Percentage]])","v":8639.657100427552},"AV",0]
["National Western","A","A","Income Outlook 5",{"$f":"IF(OR(Age<Table[[#This Row],[Min Issue Age]],Age>Table[[#This Row],[Max Issue]],HLOOKUP(State,States,ROW(Table[#This Row])-4,FALSE)=\"X\"),\"X\",MIN(IF(Age<=80,0.15,0.1),HLOOKUP($I$2,States,ROW(Table[#This Row])-4,FALSE)))","v":0.14000000000000001},0.04,null,null,null,1,null,7.4999999999999997E-3,20,60,0.08,0.01,40,1,5000,1000000,85,{"$f":"IF(Age>80,\"X\",0.12)","v":0.12},{"$f":"IF(Age>80,\"X\",0.1)","v":0.1},0.14000000000000001,0.14000000000000001,0.14000000000000001,0.14000000000000001,"X","X",{"$f":"IF(Age>80,\"X\",0.14)","v":0.14000000000000001},0.14000000000000001,0.14000000000000001,0.14000000000000001,"X",{"$f":"IF(Age>80,\"X\",0.1)","v":0.1},0.14000000000000001,0.14000000000000001,0.14000000000000001,0.14000000000000001,0.14000000000000001,0.14000000000000001,{"$f":"IF(Age>80,\"X\",0.1)","v":0.1},0.14000000000000001,{"$f":"IF(Age>80,\"X\",0.1)","v":0.1},{"$f":"IF(Age>80,\"X\",0.07)","v":7.0000000000000007E-2},0.14000000000000001,0.14000000000000001,0.14000000000000001,{"$f":"IF(Age>80,\"X\",0.1)","v":0.1},"X",{"$f":"IF(Age>80,\"X\",0.1)","v":0.1},0.14000000000000001,"X",0.14000000000000001,0.14000000000000001,{"$f":"IF(Age<=54,14%,10%)","v":0.1},0.14000000000000001,{"$f":"IF(Age>80,\"X\",0.1)","v":0.1},{"$f":"IF(Age>80,\"X\",0.1)","v":0.1},0.14000000000000001,{"$f":"IF(Age>80,\"X\",0.1)","v":0.1},0.14000000000000001,0.14000000000000001,{"$f":"IF(Age>80,\"X\",0.1)","v":0.1},{"$f":"IF(Age>80,\"X\",0.1)","v":0.1},0.14000000000000001,0.14000000000000001,{"$f":"IF(Age>80,\"X\",0.1)","v":0.1},0.14000000000000001,0.14000000000000001,0.14000000000000001,65,{"$f":"IF(Table[[#This Row],[Bonus*]]=\"X\",\"n/a\",Premium*(1+Table[[#This Row],[Bonus*]])*IF(Table[[#This Row],[Increase Type]]=\"Simple\",1,(1+Table[[#This Row],[Annual Benefit Base Increase Rate]])^MIN(TRUNC(Defer,0),Table[[#This Row],[Max Years for Increase]]))+IF(Table[[#This Row],[Increase Type]]=\"Simple\",Table[[#This Row],[Annual Benefit Base Increase Rate]]*Premium*(1+Table[[#This Row],[Rollup Bonus?]]*Table[[#This Row],[Bonus*]])*MIN(TRUNC(Defer,0),Table[[#This Row],[Max Years for Increase]]),0))","v":168747.84848069132},{"$f":"IF(Table[[#This Row],[Attained Age]]<Table[[#This Row],[Min Income Age]],0,MIN(FLOOR(Table[[#This Row],[Attained Age]]-10,5)/1000,Table[[#This Row],[Max Payout]]))","v":5.5E-2},{"$f":"IF(OR(Defer<Table[[#This Row],[Required Deferral]],Table[[#This Row],[Bonus*]]=\"X\"),0,Table[[#This Row],[Benefit Base]]*Table[[#This Row],[Single Income Percentage]])","v":9281.1316664380229},{"$f":"IF(Table[[#This Row],[Single Income Percentage]]=0,0,Table[[#This Row],[Single Income Percentage]]-Table[[#This Row],[Joint Reduction]])","v":4.4999999999999998E-2},{"$f":"IF(Table[[#This Row],[Single Annual Income]]=0,0,Table[[#This Row],[Benefit Base]]*Table[[#This Row],[Joint Income Percentage]])","v":7593.653181631109},"AV",0]
["National Western","A","A","Income Outlook",{"$f":"IF(OR(Age<Table[[#This Row],[Min Issue Age]],Age>Table[[#This Row],[Max Issue]],HLOOKUP(State,States,ROW(Table[#This Row])-4,FALSE)=\"X\"),\"X\",MIN(IF(Age<=80,0.1,0.05),HLOOKUP($I$2,States,ROW(Table[#This Row])-4,FALSE)))","v":0.09},0.04,null,null,null,1,null,3.5000000000000001E-3,20,60,0.08,0.01,40,1,5000,1000000,85,{"$f":"IF(Age>80,\"X\",0.07)","v":7.0000000000000007E-2},{"$f":"IF(Age>80,\"X\",0.05)","v":0.05},0.09,0.09,0.09,0.09,{"$f":"IF(Age>80,\"X\",0.02)","v":0.02},"X",{"$f":"IF(Age>80,\"X\",0.09)","v":0.09},0.09,0.09,0.09,"X",{"$f":"IF(Age>80,\"X\",0.05)","v":0.05},0.09,0.09,0.09,0.09,0.09,0.09,{"$f":"IF(Age>80,\"X\",0.05)","v":0.05},0.09,{"$f":"IF(Age>80,\"X\",0.05)","v":0.05},{"$f":"IF(Age>80,\"X\",0.02)","v":0.02},0.09,0.09,0.09,{"$f":"IF(Age>80,\"X\",0.05)","v":0.05},0.09,{"$f":"IF(Age>80,\"X\",0.05)","v":0.05},0.09,"X",0.09,0.09,{"$f":"IF(Age<=54,9%,5%)","v":0.05},0.09,{"$f":"IF(Age>80,\"X\",0.05)","v":0.05},{"$f":"IF(Age>80,\"X\",0.05)","v":0.05},0.09,{"$f":"IF(Age>80,\"X\",0.05)","v":0.05},0.09,0.09,{"$f":"IF(Age>80,\"X\",0.05)","v":0.05},{"$f":"IF(Age>80,\"X\",0.05)","v":0.05},0.09,0.09,{"$f":"IF(Age>80,\"X\",0.05)","v":0.05},0.09,0.09,0.09,65,{"$f":"IF(Table[[#This Row],[Bonus*]]=\"X\",\"n/a\",Premium*(1+Table[[#This Row],[Bonus*]])*IF(Table[[#This Row],[Increase Type]]=\"Simple\",1,(1+Table[[#This Row],[Annual Benefit Base Increase Rate]])^MIN(TRUNC(Defer,0),Table[[#This Row],[Max Years for Increase]]))+IF(Table[[#This Row],[Increase Type]]=\"Simple\",Table[[#This Row],[Annual Benefit Base Increase Rate]]*Premium*(1+Table[[#This Row],[Rollup Bonus?]]*Table[[#This Row],[Bonus*]])*MIN(TRUNC(Defer,0),Table[[#This Row],[Max Years for Increase]]),0))","v":161346.62705609959},{"$f":"IF(Table[[#This Row],[Attained Age]]<Table[[#This Row],[Min Income Age]],0,MIN((Table[[#This Row],[Attained Age]]-10)/1000,Table[[#This Row],[Max Payout]]))","v":5.5E-2},{"$f":"IF(OR(Defer<Table[[#This Row],[Required Deferral]],Table[[#This Row],[Bonus*]]=\"X\"),0,Table[[#This Row],[Benefit Base]]*Table[[#This Row],[Single Income Percentage]])","v":8874.0644880854779},{"$f":"IF(Table[[#This Row],[Single Income Percentage]]=0,0,Table[[#This Row],[Single Income Percentage]]-Table[[#This Row],[Joint Reduction]])","v":4.4999999999999998E-2},{"$f":"IF(Table[[#This Row],[Single Annual Income]]=0,0,Table[[#This Row],[Benefit Base]]*Table[[#This Row],[Joint Income Percentage]])","v":7260.5982175244817},"AV",0]
["North American","A+","A+","Income Pay II",{"$f":"IF(OR(Age<Table[[#This Row],[Min Issue Age]],Age>Table[[#This Row],[Max Issue]],HLOOKUP(State,States,ROW(Table[#This Row])-4,FALSE)=\"X\"),\"X\",HLOOKUP($I$2,States,ROW(Table[#This Row])-4,FALSE))","v":0.1},6.7500000000000004E-2,null,null,null,1,null,9.4999999999999998E-3,10,50,6.25E-2,5.0000000000000001E-3,40,1,10000,1000000,80,"X","X",0.1,{"$f":"Table[[#This Row],[Arizona]]","v":0.1},{"$f":"IF(Age<=65,Table[[#This Row],[Arkansas]],0.05)","v":0.1},{"$f":"Table[[#This Row],[Arkansas]]","v":0.1},"X","X",{"$f":"Table[[#This Row],[Colorado]]","v":0.1},{"$f":"Table[[#This Row],[Florida]]","v":0.1},{"$f":"Table[[#This Row],[Georgia]]","v":0.1},{"$f":"Table[[#This Row],[Hawaii]]","v":0.1},{"$f":"Table[[#This Row],[Idaho]]","v":0.1},{"$f":"IF(Age<=75,Table[[#This Row],[Illinois]],IF(Age<=79,0.05,0))","v":0.1},{"$f":"Table[[#This Row],[Illinois]]","v":0.1},{"$f":"Table[[#This Row],[Iowa]]","v":0.1},{"$f":"Table[[#This Row],[Kansas]]","v":0.1},{"$f":"Table[[#This Row],[Kentucky]]","v":0.1},{"$f":"Table[[#This Row],[Louisiana]]","v":0.1},{"$f":"Table[[#This Row],[Maine]]","v":0.1},{"$f":"Table[[#This Row],[Maryland]]","v":0.1},{"$f":"Table[[#This Row],[Massachusetts]]","v":0.1},"X",{"$f":"Table[[#This Row],[Michigan]]","v":0.1},{"$f":"Table[[#This Row],[Mississippi]]","v":0.1},{"$f":"Table[[#This Row],[Missouri]]","v":0.1},{"$f":"Table[[#This Row],[Montana]]","v":0.1},{"$f":"IF(Age<=48,Table[[#This Row],[Nebraska]],IF(Age<=53,0.05,0.03))","v":0.03},{"$f":"Table[[#This Row],[Nebraska]]","v":0.1},{"$f":"Table[[#This Row],[New Hampshire]]","v":0.1},{"$f":"Table[[#This Row],[New Jersey]]","v":0.1},"X",{"$f":"Table[[#This Row],[New Mexico]]","v":0.1},{"$f":"Table[[#This Row],[North Carolina]]","v":0.1},{"$f":"IF(Age<=49,Table[[#This Row],[North Dakota]],IF(Age<=53,0.05,0.03))","v":0.03},{"$f":"Table[[#This Row],[North Dakota]]","v":0.1},"X",{"$f":"Table[[#This Row],[Oklahoma]]","v":0.1},{"$f":"Table[[#This Row],[Pennsylvania]]","v":0.1},{"$f":"Table[[#This Row],[Rhode Island]]","v":0.1},{"$f":"Table[[#This Row],[South Carolina]]","v":0.1},{"$f":"Table[[#This Row],[South Dakota]]","v":0.1},{"$f":"IF(Age<=51,Table[[#This Row],[Tennessee]],IF(Age<=55,0.05,0.03))","v":0.05},0.02,{"$f":"Table[[#This Row],[Tennessee]]","v":0.1},{"$f":"Table[[#This Row],[Tennessee]]","v":0.1},"X",{"$f":"Table[[#This Row],[Virginia]]","v":0.1},{"$f":"Table[[#This Row],[West Virginia]]","v":0.1},{"$f":"Table[[#This Row],[Wisconsin]]","v":0.1},65,{"$f":"IF(Table[[#This Row],[Bonus*]]=\"X\",\"n/a\",Premium*(1+Table[[#This Row],[Bonus*]])*IF(Table[[#This Row],[Increase Type]]=\"Simple\",1,(1+Table[[#This Row],[Annual Benefit Base Increase Rate]])^MIN(TRUNC(Defer,0),Table[[#This Row],[Max Years for Increase]]))+IF(Table[[#This Row],[Increase Type]]=\"Simple\",Table[[#This Row],[Annual Benefit Base Increase Rate]]*Premium*(1+Table[[#This Row],[Rollup Bonus?]]*Table[[#This Row],[Bonus*]])*MIN(TRUNC(Defer,0),Table[[#This Row],[Max Years for Increase]]),0))","v":211383.7130105909},{"$f":"IF(Table[[#This Row],[Attained Age]]<Table[[#This Row],[Min Income Age]],0,IF(Table[[#This Row],[Attained Age]]<60,0.0375,MIN((FLOOR(Table[[#This Row],[Attained Age]]-20,5)+2.5)/1000,Table[[#This Row],[Max Payout]])))","v":4.7500000000000001E-2},{"$f":"IF(OR(Defer<Table[[#This Row],[Required Deferral]],Table[[#This Row],[Bonus*]]=\"X\"),0,Table[[#This Row],[Benefit Base]]*Table[[#This Row],[Single Income Percentage]])","v":10040.726368003068},{"$f":"IF(Table[[#This Row],[Single Income Percentage]]=0,0,Table[[#This Row],[Single Income Percentage]]-Table[[#This Row],[Joint Reduction]])","v":4.2500000000000003E-2},{"$f":"IF(Table[[#This Row],[Single Annual Income]]=0,0,Table[[#This Row],[Benefit Base]]*Table[[#This Row],[Joint Income Percentage]])","v":8983.8078029501139},"AV",0]
["North American","A+","A+","Income Pay III",{"$f":"IF(OR(Age<Table[[#This Row],[Min Issue Age]],Age>Table[[#This Row],[Max Issue]],HLOOKUP(State,States,ROW(Table[#This Row])-4,FALSE)=\"X\"),\"X\",HLOOKUP($I$2,States,ROW(Table[#This Row])-4,FALSE))","v":0.1},6.25E-2,null,null,null,1,null,9.4999999999999998E-3,20,50,6.25E-2,5.0000000000000001E-3,40,1,10000,1000000,80,"X","X",0.1,{"$f":"Table[[#This Row],[Arizona]]","v":0.1},{"$f":"IF(Age<=65,Table[[#This Row],[Arkansas]],0.05)","v":0.1},{"$f":"Table[[#This Row],[Arkansas]]","v":0.1},"X","X",{"$f":"Table[[#This Row],[Colorado]]","v":0.1},{"$f":"Table[[#This Row],[Florida]]","v":0.1},{"$f":"Table[[#This Row],[Georgia]]","v":0.1},{"$f":"Table[[#This Row],[Hawaii]]","v":0.1},{"$f":"Table[[#This Row],[Idaho]]","v":0.1},{"$f":"IF(Age<=75,Table[[#This Row],[Illinois]],IF(Age<=79,0.05,0))","v":0.1},{"$f":"Table[[#This Row],[Illinois]]","v":0.1},{"$f":"Table[[#This Row],[Iowa]]","v":0.1},{"$f":"Table[[#This Row],[Kansas]]","v":0.1},{"$f":"Table[[#This Row],[Kentucky]]","v":0.1},{"$f":"Table[[#This Row],[Louisiana]]","v":0.1},{"$f":"Table[[#This Row],[Maine]]","v":0.1},{"$f":"Table[[#This Row],[Maryland]]","v":0.1},{"$f":"Table[[#This Row],[Massachusetts]]","v":0.1},"X",{"$f":"Table[[#This Row],[Michigan]]","v":0.1},{"$f":"Table[[#This Row],[Mississippi]]","v":0.1},{"$f":"Table[[#This Row],[Missouri]]","v":0.1},{"$f":"Table[[#This Row],[Montana]]","v":0.1},{"$f":"IF(Age<=48,Table[[#This Row],[Nebraska]],IF(Age<=53,0.05,0.03))","v":0.03},{"$f":"Table[[#This Row],[Nebraska]]","v":0.1},{"$f":"Table[[#This Row],[New Hampshire]]","v":0.1},{"$f":"Table[[#This Row],[New Jersey]]","v":0.1},"X",{"$f":"Table[[#This Row],[New Mexico]]","v":0.1},{"$f":"Table[[#This Row],[North Carolina]]","v":0.1},{"$f":"IF(Age<=49,Table[[#This Row],[North Dakota]],IF(Age<=53,0.05,0.03))","v":0.03},{"$f":"Table[[#This Row],[North Dakota]]","v":0.1},"X",{"$f":"Table[[#This Row],[Oklahoma]]","v":0.1},{"$f":"Table[[#This Row],[Pennsylvania]]","v":0.1},{"$f":"Table[[#This Row],[Rhode Island]]","v":0.1},{"$f":"Table[[#This Row],[South Carolina]]","v":0.1},{"$f":"Table[[#This Row],[South Dakota]]","v":0.1},{"$f":"IF(Age<=51,Table[[#This Row],[Tennessee]],IF(Age<=55,0.05,0.03))","v":0.05},0.02,{"$f":"Table[[#This Row],[Tennessee]]","v":0.1},{"$f":"Table[[#This Row],[Tennessee]]","v":0.1},"X",{"$f":"Table[[#This Row],[Virginia]]","v":0.1},{"$f":"Table[[#This Row],[West Virginia]]","v":0.1},{"$f":"Table[[#This Row],[Wisconsin]]","v":0.1},65,{"$f":"IF(Table[[#This Row],[Bonus*]]=\"X\",\"n/a\",Premium*(1+Table[[#This Row],[Bonus*]])*IF(Table[[#This Row],[Increase Type]]=\"Simple\",1,(1+Table[[#This Row],[Annual Benefit Base Increase Rate]])^MIN(TRUNC(Defer,0),Table[[#This Row],[Max Years for Increase]]))+IF(Table[[#This Row],[Increase Type]]=\"Simple\",Table[[#This Row],[Annual Benefit Base Increase Rate]]*Premium*(1+Table[[#This Row],[Rollup Bonus?]]*Table[[#This Row],[Bonus*]])*MIN(TRUNC(Defer,0),Table[[#This Row],[Max Years for Increase]]),0))","v":201688.93483913963},{"$f":"IF(Table[[#This Row],[Attained Age]]<Table[[#This Row],[Min Income Age]],0,IF(Table[[#This Row],[Attained Age]]<60,0.0375,MIN((FLOOR(Table[[#This Row],[Attained Age]]-20,5)+2.5)/1000,Table[[#This Row],[Max Payout]])))","v":4.7500000000000001E-2},{"$f":"IF(OR(Defer<Table[[#This Row],[Required Deferral]],Table[[#This Row],[Bonus*]]=\"X\"),0,Table[[#This Row],[Benefit Base]]*Table[[#This Row],[Single Income Percentage]])","v":9580.2244048591328},{"$f":"IF(Table[[#This Row],[Single Income Percentage]]=0,0,Table[[#This Row],[Single Income Percentage]]-Table[[#This Row],[Joint Reduction]])","v":4.2500000000000003E-2},{"$f":"IF(Table[[#This Row],[Single Annual Income]]=0,0,Table[[#This Row],[Benefit Base]]*Table[[#This Row],[Joint Income Percentage]])","v":8571.7797306634347},"AV",0]
["North American","A+","A+","Income Pay I",{"$f":"IF(OR(Age<Table[[#This Row],[Min Issue Age]],Age>Table[[#This Row],[Max Issue]],HLOOKUP(State,States,ROW(Table[#This Row])-4,FALSE)=\"X\"),\"X\",HLOOKUP($I$2,States,ROW(Table[#This Row])-4,FALSE))","v":0.1},5.5E-2,null,null,null,1,null,4.0000000000000001E-3,"none",50,6.25E-2,5.0000000000000001E-3,40,1,10000,1000000,80,"X","X",0.1,{"$f":"Table[[#This Row],[Arizona]]","v":0.1},{"$f":"IF(Age<=65,Table[[#This Row],[Arkansas]],0.05)","v":0.1},{"$f":"Table[[#This Row],[Arkansas]]","v":0.1},"X","X",{"$f":"Table[[#This Row],[Colorado]]","v":0.1},{"$f":"Table[[#This Row],[Florida]]","v":0.1},{"$f":"Table[[#This Row],[Georgia]]","v":0.1},{"$f":"Table[[#This Row],[Hawaii]]","v":0.1},{"$f":"Table[[#This Row],[Idaho]]","v":0.1},{"$f":"IF(Age<=75,Table[[#This Row],[Illinois]],IF(Age<=79,0.05,0))","v":0.1},{"$f":"Table[[#This Row],[Illinois]]","v":0.1},{"$f":"Table[[#This Row],[Iowa]]","v":0.1},{"$f":"Table[[#This Row],[Kansas]]","v":0.1},{"$f":"Table[[#This Row],[Kentucky]]","v":0.1},{"$f":"Table[[#This Row],[Louisiana]]","v":0.1},{"$f":"Table[[#This Row],[Maine]]","v":0.1},{"$f":"Table[[#This Row],[Maryland]]","v":0.1},{"$f":"Table[[#This Row],[Georgia]]","v":0.1},"X",{"$f":"Table[[#This Row],[Michigan]]","v":0.1},{"$f":"Table[[#This Row],[Mississippi]]","v":0.1},{"$f":"Table[[#This Row],[Missouri]]","v":0.1},{"$f":"Table[[#This Row],[Montana]]","v":0.1},{"$f":"IF(Age<=48,Table[[#This Row],[Nebraska]],IF(Age<=53,0.05,0.03))","v":0.03},{"$f":"Table[[#This Row],[Nebraska]]","v":0.1},{"$f":"Table[[#This Row],[New Hampshire]]","v":0.1},{"$f":"Table[[#This Row],[New Jersey]]","v":0.1},"X",{"$f":"Table[[#This Row],[New Mexico]]","v":0.1},{"$f":"Table[[#This Row],[North Carolina]]","v":0.1},{"$f":"IF(Age<=49,Table[[#This Row],[North Dakota]],IF(Age<=53,0.05,0.03))","v":0.03},{"$f":"Table[[#This Row],[North Dakota]]","v":0.1},"X",{"$f":"Table[[#This Row],[Oklahoma]]","v":0.1},{"$f":"Table[[#This Row],[Pennsylvania]]","v":0.1},{"$f":"Table[[#This Row],[Rhode Island]]","v":0.1},{"$f":"Table[[#This Row],[South Carolina]]","v":0.1},{"$f":"Table[[#This Row],[South Dakota]]","v":0.1},{"$f":"IF(Age<=51,Table[[#This Row],[Tennessee]],IF(Age<=55,0.05,0.03))","v":0.05},0.02,{"$f":"Table[[#This Row],[Tennessee]]","v":0.1},{"$f":"Table[[#This Row],[Tennessee]]","v":0.1},"X",{"$f":"Table[[#This Row],[Virginia]]","v":0.1},{"$f":"Table[[#This Row],[West Virginia]]","v":0.1},{"$f":"Table[[#This Row],[Wisconsin]]","v":0.1},65,{"$f":"IF(Table[[#This Row],[Bonus*]]=\"X\",\"n/a\",Premium*(1+Table[[#This Row],[Bonus*]])*IF(Table[[#This Row],[Increase Type]]=\"Simple\",1,(1+Table[[#This Row],[Annual Benefit Base Increase Rate]])^MIN(TRUNC(Defer,0),Table[[#This Row],[Max Years for Increase]]))+IF(Table[[#This Row],[Increase Type]]=\"Simple\",Table[[#This Row],[Annual Benefit Base Increase Rate]]*Premium*(1+Table[[#This Row],[Rollup Bonus?]]*Table[[#This Row],[Bonus*]])*MIN(TRUNC(Defer,0),Table[[#This Row],[Max Years for Increase]]),0))","v":187895.89041889526},{"$f":"IF(Table[[#This Row],[Attained Age]]<Table[[#This Row],[Min Income Age]],0,IF(Table[[#This Row],[Attained Age]]<60,0.0375,MIN((FLOOR(Table[[#This Row],[Attained Age]]-20,5)+2.5)/1000,Table[[#This Row],[Max Payout]])))","v":4.7500000000000001E-2},{"$f":"IF(OR(Defer<Table[[#This Row],[Required Deferral]],Table[[#This Row],[Bonus*]]=\"X\"),0,Table[[#This Row],[Benefit Base]]*Table[[#This Row],[Single Income Percentage]])","v":8925.0547948975254},{"$f":"IF(Table[[#This Row],[Single Income Percentage]]=0,0,Table[[#This Row],[Single Income Percentage]]-Table[[#This Row],[Joint Reduction]])","v":4.2500000000000003E-2},{"$f":"IF(Table[[#This Row],[Single Annual Income]]=0,0,Table[[#This Row],[Benefit Base]]*Table[[#This Row],[Joint Income Percentage]])","v":7985.5753428030494},"AV",0]
["North American","A+","A+","IncomeChoice",{"$f":"IF(OR(Age<Table[[#This Row],[Min Issue Age]],Age>Table[[#This Row],[Max Issue]],HLOOKUP(State,States,ROW(Table[#This Row])-4,FALSE)=\"X\"),\"X\",MIN(IF(Age<=75,0.1,IF(Age<=80,0.05,0)),HLOOKUP($I$2,States,ROW(Table[#This Row])-4,FALSE)))","v":0.05},{"$f":"5%+((ror*Premium)/Premium)","v":0.05},null,null,null,1,null,0,20,50,6.6500000000000004E-2,5.0000000000000001E-3,40,1,50000,1000000,79,0.05,0.05,0.05,0.05,"X",0.05,"X","X",0.05,0.05,0.05,0.05,0.05,0.05,0.05,0.05,0.05,0.05,0.05,"X",0.05,0.05,"X","X","X",0.05,0.05,"X","X",0.05,0.05,"X",0.05,0.05,"X",0.05,"X",0.05,0.05,"X",0.05,0.05,"X","X","X","X","X",0.05,0.05,0.05,65,{"$f":"IF(Table[[#This Row],[Bonus*]]=\"X\",\"n/a\",Premium*(1+Table[[#This Row],[Bonus*]])*IF(Table[[#This Row],[Increase Type]]=\"Simple\",1,(1+Table[[#This Row],[Annual Benefit Base Increase Rate]])^MIN(TRUNC(Defer,0),Table[[#This Row],[Max Years for Increase]]))+IF(Table[[#This Row],[Increase Type]]=\"Simple\",Table[[#This Row],[Annual Benefit Base Increase Rate]]*Premium*(1+Table[[#This Row],[Rollup Bonus?]]*Table[[#This Row],[Bonus*]])*MIN(TRUNC(Defer,0),Table[[#This Row],[Max Years for Increase]]),0))","v":171033.93581163135},{"$f":"IF(Table[[#This Row],[Attained Age]]<Table[[#This Row],[Min Income Age]],0,IF(Table[[#This Row],[Attained Age]]<60,0.0415,MIN((Table[[#This Row],[Attained Age]]-13.5)/1000,Table[[#This Row],[Max Payout]])))","v":5.1499999999999997E-2},{"$f":"IF(OR(Defer<Table[[#This Row],[Required Deferral]],Table[[#This Row],[Bonus*]]=\"X\"),0,Table[[#This Row],[Benefit Base]]*Table[[#This Row],[Single Income Percentage]])","v":8808.2476942990143},{"$f":"IF(Table[[#This Row],[Single Income Percentage]]=0,0,Table[[#This Row],[Single Income Percentage]]-Table[[#This Row],[Joint Reduction]])","v":4.65E-2},{"$f":"IF(Table[[#This Row],[Single Annual Income]]=0,0,Table[[#This Row],[Benefit Base]]*Table[[#This Row],[Joint Income Percentage]])","v":7953.0780152408579},"AV",0]
["Phoenix","B","BB-","PIA Tomorrow",{"$f":"IF(OR(Age<Table[[#This Row],[Min Issue Age]],Age>Table[[#This Row],[Max Issue]]),\"X\",HLOOKUP(State,States,ROW(Table[#This Row])-4,FALSE))","v":0},0.14000000000000001,0.03,10,"Simple",null,null,9.4999999999999998E-3,20,50,6.1800000000000001E-2,0,40,0,15000,1000000,85,0,0,0,0,0,0,0,0,0,0,0,0,0,0,0,0,0,0,"X",0,0,0,0,0,0,0,0,0,0,0,0,"X",0,0,0,0,0,0,0,0,0,0,0,0,0,0,0,0,0,0,65,{"$f":"IF(Table[[#This Row],[Bonus*]]=\"X\",\"n/a\",Premium*(1+Table[[#This Row],[Bonus*]])*IF(Table[[#This Row],[Increase Type]]=\"Simple\",1,(1+Table[[#This Row],[Annual Benefit Base Increase Rate]])^MIN(TRUNC(Defer,0),Table[[#This Row],[Rollup Switch]])*(1+Table[[#This Row],[Rollup2]])^MIN(MAX(TRUNC(Defer,0)-Table[[#This Row],[Rollup Switch]],0),Table[[#This Row],[Max Years for Increase]]-Table[[#This Row],[Rollup Switch]]))+IF(Table[[#This Row],[Increase Type]]=\"Simple\",Premium*(1+Table[[#This Row],[Rollup Bonus?]]*Table[[#This Row],[Bonus*]])*(Table[[#This Row],[Annual Benefit Base Increase Rate]]*MIN(TRUNC(Defer,0),Table[[#This Row],[Rollup Switch]])+Table[[#This Row],[Rollup2]]*MIN(MAX(Defer-Table[[#This Row],[Rollup Switch]],0),Table[[#This Row],[Max Years for Increase]]-Table[[#This Row],[Rollup Switch]])),0))","v":240000},{"$f":"INDEX(PIATomorrowSingle!A1:CQ86,Age,Table[[#This Row],[Attained Age]])*0.01","v":4.1200000000000001E-2},{"$f":"IF(OR(Defer<Table[[#This Row],[Required Deferral]],Table[[#This Row],[Bonus*]]=\"X\"),0,Table[[#This Row],[Benefit Base]]*Table[[#This Row],[Single Income Percentage]])","v":9888},{"$f":"INDEX(PIATomorrowJoint!A1:CQ86,Age,Table[[#This Row],[Attained Age]])*0.01","v":3.6200000000000003E-2},{"$f":"IF(Table[[#This Row],[Single Annual Income]]=0,0,Table[[#This Row],[Benefit Base]]*Table[[#This Row],[Joint Income Percentage]])","v":8688},"AV",0]
["Phoenix","B","BB-","PIA Today",{"$f":"IF(OR(Age<Table[[#This Row],[Min Issue Age]],Age>Table[[#This Row],[Max Issue]]),\"X\",HLOOKUP(State,States,ROW(Table[#This Row])-4,FALSE))","v":0.45},0.03,null,null,null,null,null,9.4999999999999998E-3,20,50,6.1800000000000001E-2,0,40,0,15000,1000000,85,{"$f":"VLOOKUP(Defer,PIA!$A$2:$B$22,2,FALSE)","v":0.45},{"$f":"VLOOKUP(Defer,PIA!$A$2:$B$22,2,FALSE)","v":0.45},{"$f":"VLOOKUP(Defer,PIA!$A$2:$B$22,2,FALSE)","v":0.45},{"$f":"VLOOKUP(Defer,PIA!$A$2:$B$22,2,FALSE)","v":0.45},{"$f":"VLOOKUP(Defer,PIA!$A$2:$B$22,2,FALSE)","v":0.45},{"$f":"VLOOKUP(Defer,PIA!$A$2:$B$22,2,FALSE)","v":0.45},{"$f":"VLOOKUP(Defer,PIA!$A$2:$B$22,2,FALSE)","v":0.45},{"$f":"VLOOKUP(Defer,PIA!$A$2:$B$22,2,FALSE)","v":0.45},{"$f":"VLOOKUP(Defer,PIA!$A$2:$B$22,2,FALSE)","v":0.45},{"$f":"VLOOKUP(Defer,PIA!$A$2:$B$22,2,FALSE)","v":0.45},{"$f":"VLOOKUP(Defer,PIA!$A$2:$B$22,2,FALSE)","v":0.45},{"$f":"VLOOKUP(Defer,PIA!$A$2:$B$22,2,FALSE)","v":0.45},{"$f":"VLOOKUP(Defer,PIA!$A$2:$B$22,2,FALSE)","v":0.45},{"$f":"VLOOKUP(Defer,PIA!$A$2:$B$22,2,FALSE)","v":0.45},{"$f":"VLOOKUP(Defer,PIA!$A$2:$B$22,2,FALSE)","v":0.45},{"$f":"VLOOKUP(Defer,PIA!$A$2:$B$22,2,FALSE)","v":0.45},{"$f":"VLOOKUP(Defer,PIA!$A$2:$B$22,2,FALSE)","v":0.45},{"$f":"VLOOKUP(Defer,PIA!$A$2:$B$22,2,FALSE)","v":0.45},"X",{"$f":"VLOOKUP(Defer,PIA!$A$2:$B$32,2,FALSE)","v":0.45},{"$f":"VLOOKUP(Defer,PIA!$A$2:$B$32,2,FALSE)","v":0.45},{"$f":"VLOOKUP(Defer,PIA!$A$2:$B$32,2,FALSE)","v":0.45},{"$f":"VLOOKUP(Defer,PIA!$A$2:$B$32,2,FALSE)","v":0.45},{"$f":"VLOOKUP(Defer,PIA!$A$2:$B$32,2,FALSE)","v":0.45},{"$f":"VLOOKUP(Defer,PIA!$A$2:$B$32,2,FALSE)","v":0.45},{"$f":"VLOOKUP(Defer,PIA!$A$2:$B$32,2,FALSE)","v":0.45},{"$f":"VLOOKUP(Defer,PIA!$A$2:$B$32,2,FALSE)","v":0.45},{"$f":"VLOOKUP(Defer,PIA!$A$2:$B$32,2,FALSE)","v":0.45},{"$f":"VLOOKUP(Defer,PIA!$A$2:$B$32,2,FALSE)","v":0.45},{"$f":"VLOOKUP(Defer,PIA!$A$2:$B$32,2,FALSE)","v":0.45},{"$f":"VLOOKUP(Defer,PIA!$A$2:$B$32,2,FALSE)","v":0.45},"X",{"$f":"VLOOKUP(Defer,PIA!$A$2:$B$22,2,FALSE)","v":0.45},{"$f":"VLOOKUP(Defer,PIA!$A$2:$B$22,2,FALSE)","v":0.45},{"$f":"VLOOKUP(Defer,PIA!$A$2:$B$22,2,FALSE)","v":0.45},{"$f":"VLOOKUP(Defer,PIA!$A$2:$B$22,2,FALSE)","v":0.45},{"$f":"VLOOKUP(Defer,PIA!$A$2:$B$22,2,FALSE)","v":0.45},{"$f":"VLOOKUP(Defer,PIA!$A$2:$B$22,2,FALSE)","v":0.45},{"$f":"VLOOKUP(Defer,PIA!$A$2:$B$22,2,FALSE)","v":0.45},{"$f":"VLOOKUP(Defer,PIA!$A$2:$B$22,2,FALSE)","v":0.45},{"$f":"VLOOKUP(Defer,PIA!$A$2:$B$22,2,FALSE)","v":0.45},{"$f":"VLOOKUP(Defer,PIA!$A$2:$B$22,2,FALSE)","v":0.45},{"$f":"VLOOKUP(Defer,PIA!$A$2:$B$22,2,FALSE)","v":0.45},{"$f":"VLOOKUP(Defer,PIA!$A$2:$B$22,2,FALSE)","v":0.45},{"$f":"VLOOKUP(Defer,PIA!$A$2:$B$22,2,FALSE)","v":0.45},{"$f":"VLOOKUP(Defer,PIA!$A$2:$B$22,2,FALSE)","v":0.45},{"$f":"VLOOKUP(Defer,PIA!$A$2:$B$22,2,FALSE)","v":0.45},{"$f":"VLOOKUP(Defer,PIA!$A$2:$B$22,2,FALSE)","v":0.45},{"$f":"VLOOKUP(Defer,PIA!$A$2:$B$22,2,FALSE)","v":0.45},{"$f":"VLOOKUP(Defer,PIA!$A$2:$B$22,2,FALSE)","v":0.45},65,{"$f":"IF(Table[[#This Row],[Bonus*]]=\"x\", \"n/a\",VLOOKUP(Defer,PIA!A1:F22,4,FALSE))","v":176200},{"$f":"INDEX(PIATodaySingle!$A$1:$CQ$86,Age,Table[[#This Row],[Attained Age]])*0.01","v":4.7E-2},{"$f":"IF(OR(Defer<Table[[#This Row],[Required Deferral]],Table[[#This Row],[Bonus*]]=\"X\"),0,Table[[#This Row],[Benefit Base]]*Table[[#This Row],[Single Income Percentage]])","v":8281.4},{"$f":"INDEX(PIATodayJoint!$A$1:$CQ$86,Age,Table[[#This Row],[Attained Age]])*0.01","v":4.2000000000000003E-2},{"$f":"IF(Table[[#This Row],[Single Annual Income]]=0,0,Table[[#This Row],[Benefit Base]]*Table[[#This Row],[Joint Income Percentage]])","v":7400.4000000000005},"AV",0]
["Security Benefit3","B++","A-","SIA GLWB",{"$f":"IF(OR(Age<Table[[#This Row],[Min Issue Age]],Age>Table[[#This Row],[Max Issue]]),\"X\",HLOOKUP(State,States,ROW(Table[#This Row])-4,FALSE))","v":0.08},7.0000000000000007E-2,null,null,null,1,null,9.4999999999999998E-3,{"$f":"IF(Age=80,5,MAX(MIN(IF(FLOOR(Age,5)<>FLOOR(Age,10),85-Age,80-FLOOR(Age,10)),20),0))","v":20},55,7.8E-2,7.0000000000000001E-3,55,0,25000,1000000,80,0.08,5.5E-2,0.08,0.08,7.0000000000000007E-2,0.08,0.02,0.02,0.08,0.08,0.08,0.08,0.08,5.5E-2,0.08,0.08,0.08,0.08,5.5E-2,0.08,0.08,0.08,5.5E-2,0.08,5.5E-2,0.08,0.08,5.5E-2,5.5E-2,5.5E-2,0.08,"X",0.08,0.08,5.5E-2,0.08,5.5E-2,5.5E-2,0.08,5.5E-2,0.08,0.08,5.5E-2,5.5E-2,0.08,0.08,5.5E-2,0.08,0.08,0.08,65,{"$f":"IF(Table[[#This Row],[Bonus*]]=\"X\",\"n/a\",Premium*(1+Table[[#This Row],[Bonus*]])*IF(Table[[#This Row],[Increase Type]]=\"Simple\",1,(1+Table[[#This Row],[Annual Benefit Base Increase Rate]])^MIN(TRUNC(Defer,0),Table[[#This Row],[Max Years for Increase]]))+IF(Table[[#This Row],[Increase Type]]=\"Simple\",Table[[#This Row],[Annual Benefit Base Increase Rate]]*Premium*(1+Table[[#This Row],[Rollup Bonus?]]*Table[[#This Row],[Bonus*]])*MIN(TRUNC(Defer,0),Table[[#This Row],[Max Years for Increase]]),0))","v":212452.34658727309},{"$f":"IF(Table[[#This Row],[Attained Age]]<Table[[#This Row],[Min Income Age]],0,MIN((Table[[#This Row],[Attained Age]]-12)/1000,Table[[#This Row],[Max Payout]]))","v":5.2999999999999999E-2},{"$f":"IF(OR(Defer<Table[[#This Row],[Required Deferral]],Table[[#This Row],[Bonus*]]=\"X\"),0,Table[[#This Row],[Benefit Base]]*Table[[#This Row],[Single Income Percentage]])","v":11259.974369125473},{"$f":"IF(Table[[#This Row],[Single Income Percentage]]=0,0,Table[[#This Row],[Single Income Percentage]]-Table[[#This Row],[Joint Reduction]])","v":4.5999999999999999E-2},{"$f":"IF(Table[[#This Row],[Single Annual Income]]=0,0,Table[[#This Row],[Benefit Base]]*Table[[#This Row],[Joint Income Percentage]])","v":9772.8079430145626},"AV",0]
["Security Benefit3","B++","A-","TVA GLWB/GMDB",{"$f":"IFERROR(IF(OR(Age<Table[[#This Row],[Min Issue Age]],Age>Table[[#This Row],[Max Issue]]),\"X\",HLOOKUP(State,States,ROW(Table[#This Row])-4,FALSE)),\"X\")","v":0.08},{"$f":"HLOOKUP(Table[[#This Row],[Increase Type]],TVA_Rate,2,FALSE)","v":5.5E-2},null,null,"Fixed",1,null,9.4999999999999998E-3,{"$f":"IF(Age=80,4,MAX(MIN(IF(FLOOR(Age,5)<>FLOOR(Age,10),85-Age,80-FLOOR(Age,10)),20),0))","v":20},50,0.08,7.0000000000000001E-3,0,0,25000,1000000,80,0.08,0.06,0.08,0.08,7.0000000000000007E-2,0.08,0.02,0.02,7.0000000000000007E-2,0.08,0.08,0.08,0.08,0.06,"X",0.08,0.08,0.08,0.06,0.08,0.08,0.08,0.06,0.08,0.06,0.08,0.08,0.06,0.06,0.06,0.08,"X",0.08,0.08,0.06,0.08,0.06,0.06,0.08,0.06,0.08,0.08,0.06,0.06,0.08,0.08,0.06,0.08,0.08,0.08,65,{"$f":"IF(Table[[#This Row],[Bonus*]]=\"X\",\"n/a\",Premium*(1+Table[[#This Row],[Bonus*]])*VLOOKUP(MIN(TRUNC(Defer,0),MAX(Table[[#This Row],[Max Years for Increase]],5)),TVA_Rollup,MATCH(Table[[#This Row],[Increase Type]],TVA_Type,0)+1,FALSE))","v":184479.60150218804},{"$f":"IF(Table[[#This Row],[Attained Age]]<Table[[#This Row],[Min Income Age]],0,MIN((Table[[#This Row],[Attained Age]]-12)/1000,Table[[#This Row],[Max Payout]]))","v":5.2999999999999999E-2},{"$f":"IF(OR(Age<50,Defer<Table[[#This Row],[Required Deferral]],Table[[#This Row],[Bonus*]]=\"X\"),0,Table[[#This Row],[Benefit Base]]*Table[[#This Row],[Single Income Percentage]])","v":9777.4188796159669},{"$f":"IF(Table[[#This Row],[Single Income Percentage]]=0,0,Table[[#This Row],[Single Income Percentage]]-Table[[#This Row],[Joint Reduction]])","v":4.5999999999999999E-2},{"$f":"IF(OR(Age<50,Table[[#This Row],[Single Annual Income]]=0),0,Table[[#This Row],[Benefit Base]]*Table[[#This Row],[Joint Income Percentage]])","v":8486.0616691006508},"Rider",{"$f":"MIN(IF(OR(Table[[#This Row],[Bonus*]]=\"X\",State=\"California\",State=\"Connecticut\",State=\"Missouri\",State=\"Nevada\",State=\"New Hampshire\",State=\"Washington\"),0,Premium*(1+Table[[#This Row],[Bonus*]]-0.01-IF(AND(Age>=76,State<>\"Connecticut\",State<>\"Delaware\"),0.01,0))*(1+Table[[#This Row],[Annual Benefit Base Increase Rate]])^MIN(TRUNC(Defer,0),MAX(80-Age,5))),Premium*3)","v":182771.45704383444}]
["Security Benefit3","B++","A-","Assumed Rate TVA",{"$f":"IFERROR(IF(OR(Age<Table[[#This Row],[Min Issue Age]],Age>Table[[#This Row],[Max Issue]]),\"X\",HLOOKUP(State,States,ROW(Table[#This Row])-4,FALSE)),\"X\")","v":0.08},{"$f":"0.04+ror","v":0.04},null,null,null,1,null,9.4999999999999998E-3,{"$f":"IF(Age=80,4,MAX(MIN(IF(FLOOR(Age,5)<>FLOOR(Age,10),85-Age,80-FLOOR(Age,10)),20),0))","v":20},50,0.08,7.0000000000000001E-3,0,0,25000,1000000,80,0.08,0.06,0.08,0.08,7.0000000000000007E-2,0.08,0.02,0.02,7.0000000000000007E-2,0.08,0.08,0.08,0.08,0.06,"X",0.08,0.08,0.08,0.06,0.08,0.08,0.08,0.06,0.08,0.06,0.08,0.08,0.06,0.06,0.06,0.08,"X",0.08,0.08,0.06,0.08,0.06,0.06,0.08,0.06,0.08,0.08,0.06,0.06,0.08,0.08,0.06,0.08,0.08,0.08,65,{"$f":"IF(Table[[#This Row],[Bonus*]]=\"X\",\"n/a\",Premium*(1+Table[[#This Row],[Bonus*]])*IF(Table[[#This Row],[Increase Type]]=\"Simple\",1,(1+Table[[#This Row],[Annual Benefit Base Increase Rate]])^MIN(TRUNC(Defer,0),Table[[#This Row],[Max Years for Increase]]))+IF(Table[[#This Row],[Increase Type]]=\"Simple\",Table[[#This Row],[Annual Benefit Base Increase Rate]]*Premium*(1+Table[[#This Row],[Rollup Bonus?]]*Table[[#This Row],[Bonus*]])*MIN(TRUNC(Defer,0),Table[[#This Row],[Max Years for Increase]]),0))","v":159866.3827711812},{"$f":"IF(Table[[#This Row],[Attained Age]]<Table[[#This Row],[Min Income Age]],0,MIN((Table[[#This Row],[Attained Age]]-12)/1000,Table[[#This Row],[Max Payout]]))","v":5.2999999999999999E-2},{"$f":"IF(OR(Age<50,Defer<Table[[#This Row],[Required Deferral]],Table[[#This Row],[Bonus*]]=\"X\"),0,Table[[#This Row],[Benefit Base]]*Table[[#This Row],[Single Income Percentage]])","v":8472.9182868726039},{"$f":"IF(Table[[#This Row],[Single Income Percentage]]=0,0,Table[[#This Row],[Single Income Percentage]]-Table[[#This Row],[Joint Reduction]])","v":4.5999999999999999E-2},{"$f":"IF(OR(Age<50,Table[[#This Row],[Single Annual Income]]=0),0,Table[[#This Row],[Benefit Base]]*Table[[#This Row],[Joint Income Percentage]])","v":7353.8536074743351},"Rider",{"$f":"MIN(IF(OR(Table[[#This Row],[Bonus*]]=\"X\",State=\"California\",State=\"Connecticut\",State=\"Missouri\",State=\"Nevada\",State=\"New Hampshire\",State=\"Washington\"),0,Premium*(1+Table[[#This Row],[Bonus*]]-0.01-IF(AND(Age>=76,State<>\"Connecticut\",State<>\"Delaware\"),0.01,0))*(1+Table[[#This Row],[Annual Benefit Base Increase Rate]])^MIN(TRUNC(Defer,0),MAX(80-Age,5))),Premium*3)","v":158386.13848626288}]
["Sentinel","B++",null,"Summit Bonus",{"$f":"IF(OR(Age<Table[[#This Row],[Min Issue Age]],Age>Table[[#This Row],[Max Issue]]),\"X\",IFERROR(HLOOKUP(State,States,ROW(Table[#This Row])-4,FALSE)+0.01,\"X\"))","v":"X"},0.06,null,null,null,1,null,1.0500000000000001E-2,{"$f":"IF(Age=80,5,MAX(MIN(IF(FLOOR(Age,5)<>FLOOR(Age,10),85-Age,80-FLOOR(Age,10)),20),0))","v":20},55,0.08,5.0000000000000001E-3,45,1,10000,1000000,80,"X","X","X","X",7.0000000000000007E-2,"X","X","X",7.0000000000000007E-2,"X","X","X","X","X","X","X","X","X","X","X","X","X","X","X","X","X","X","X","X","X","X","X",7.0000000000000007E-2,"X","X","X","X",4.4999999999999998E-2,"X","X","X","X",4.4999999999999998E-2,4.4999999999999998E-2,"X","X","X","X","X","X",65,{"$f":"IF(Table[[#This Row],[Bonus*]]=\"X\",\"n/a\",Premium*(1+Table[[#This Row],[Bonus*]])*IF(Table[[#This Row],[Increase Type]]=\"Simple\",1,(1+Table[[#This Row],[Annual Benefit Base Increase Rate]])^MIN(TRUNC(Defer,0),Table[[#This Row],[Max Years for Increase]]))+IF(Table[[#This Row],[Increase Type]]=\"Simple\",Table[[#This Row],[Annual Benefit Base Increase Rate]]*Premium*(1+Table[[#This Row],[Rollup Bonus?]]*Table[[#This Row],[Bonus*]])*MIN(TRUNC(Defer,0),Table[[#This Row],[Max Years for Increase]]),0))","v":"n/a"},{"$f":"IF(Table[[#This Row],[Attained Age]]<Table[[#This Row],[Min Income Age]],0,MIN((Table[[#This Row],[Attained Age]]-10)/1000,Table[[#This Row],[Max Payout]]))","v":5.5E-2},{"$f":"IF(OR(Defer<Table[[#This Row],[Required Deferral]],Table[[#This Row],[Bonus*]]=\"X\"),0,Table[[#This Row],[Benefit Base]]*Table[[#This Row],[Single Income Percentage]])","v":0},{"$f":"IF(Table[[#This Row],[Single Income Percentage]]=0,0,Table[[#This Row],[Single Income Percentage]]-Table[[#This Row],[Joint Reduction]])","v":0.05},{"$f":"IF(Table[[#This Row],[Single Annual Income]]=0,0,Table[[#This Row],[Benefit Base]]*Table[[#This Row],[Joint Income Percentage]])","v":0},"AV",0]
[]
["FOR AGENT USE ONLY.  NOT FOR USE WITH THE GENERAL PUBLIC. \n\nAgents who utilize this tool should recognize that it represents a comparison of various features of income riders and it does not provide a comparison of the underlying annuity products.  It is not intended to be a complete comparison of various insurer’s products and riders.  Any product recommendation made to a customer should include a careful evaluation of both the annuity product and any available riders.  This summary of the amount of guaranteed lifetime income withdrawals assume that the client complies with the terms of conditions of the respective Income Riders.  Withdrawals from the fixed indexed annuities other than the guaranteed lifetime income withdrawals may result in the loss of the guaranteed benefits.\n\nThe Bonus assumes that the Income Rider is added to the fixed indexed annuity.  A lower Bonus may apply to the fixed indexed annuity if the Income Rider is not purchased.  Annuities with a bonus may use factors that result in lower interest credited in future years or have higher surrender charges or longer surrender charge periods than similar annuities that do not include bonuses.\n\nIncome Riders generally provide for a Benefit Base (name varies by insurance carrier) which can be taken through Annual/Lifetime Income Withdrawals. The Benefit Base generally increases annually until lifetime income is taken or until the end of a term set forth in the Income Rider.  The Benefit Base is not an amount that can be withdrawn, available for death benefits, or annuitized.  The Annual Benefit Base Increase Rate is not interest that is credited to the annuity account value.  An income rider is an optional benefit available for an additional charge.   \n\nThe assumptions used in this illustration are not guaranteed; this illustration assumes no additional Premium and no Withdrawals are taken prior to the date indicated. Rider charges will be automatically deducted from the account value of your contract, but are not reflected in this illustration. \n\nProduct features, limitations and availability vary by state. Guarantees provided by each Rider are subject to the financial strength and claims-paying ability of the issuing insurance company."]

{"sheet":"Disclosures","index":1,"n_rows":3,"n_cols":1,"rows_kept":3,"cut":false,"hidden":false,"merged":[]}
["1 Lifetime Income Benefit Rider (LIBR-2010) issued by American Equity Investment Life Insurance Company, West Des Moines, IA. By choosing the 8% IAV Option you will be charged a 0.90% annual fee from your contract value.  5% Option is available for all issue ages for no fee. 8% Option available for ages 50+. Income Account Value (IAV) only used to calculate lifetime income payments.  Not part of underlying contract value or available in a lump sum. Not included in death benefit.  Interest grows until the earlier of payments beginning or the end of the IAV period. If payments not elected by 10th contract anniversary for the 5% Option or by the 7th contract anniversary for the 8% Option, growth of IAV will stop unless client elects to restart accumulation period. Claims paying ability based on the financial strength of American Equity. See brochure and disclosure for details.  11-AE-1517"]
["2 IncomeSecure Rider (R6036711NW), IncomeSustainer Plus Rider (R6032810NW), and Inheritance Enhancer Rider (R6042513NW) are issued by Great American Life Insurance Company®, Cincinnati, OH.  By choosing IncomeSecure you will be charged 0.85% of the BBA annually from your contract value.  IncomeSecure is available for issue ages 40-70 for Qualified money, and 40-85 for Non-Qualified.  By choosing IncomeSustainer Plus, you will be charged 1.25% of the BBA annually from your contract value.  IncomeSustainer Plus is available for issue ages 50-85.  By choosing Inheritance Enhancer, you will be charged 0.75% of the BBA annually from your contract value.  Inheritance Enhancer is available for issue ages 50-85.  Benefit Base Amount (BBA) is only used to calculate lifetime income payments and grows by 10% simple interest annually on IncomeSecure, 8% simple interest annually on IncomeSustainer Plus, and 7% simple interest annually on Inheritance Enhancer.  It is not part of the underlying contract value or available in a lump sum.  Interest grows until the earlier of payments beginning or the end of the rollup period. If payments not elected by 10th contract anniversary, growth of BBA will stop unless client elects a reset that restarts the rollup period.  A 5-year annuitization of the BBA is available as a death benefit on the IncomeSustainer Plus and Inheritance Enhancer Riders only.  The BBA is not available as a death benefit on the IncomeSecure. Claims paying ability based on the financial strength of Great American Life Insurance Company.  See brochure and disclosure for details.  Rider form numbers may vary by state.  Riders may not be available in all states.  COM11295-3."]
["3 Secure Income Annuity (Form 5800 (11-10) and ICC10 5800 (11-10)) and its optional benefit rider, the Guaranteed Lifetime Withdrawal Rider (GLWB Rider) (Form 5820 (11-10) and ICC10 5820 (11-10)), are issued by Security Benefit Life Insurance Company.  The Guaranteed Lifetime Withdrawal Rider may only be purchased at the time of application.  If your client takes certain withdrawals from or surrenders the Secure Income Annuity within 10 years of purchase, a surrender charge, bonus recapture and market value adjustment may apply and reduce the amount your client receives.  \nBefore your client purchases the Secure Income Annuity and the GLWB Rider, you must review with your client the Statement of Understanding (SOU) for the Secure Income Annuity.  The SOU explains the benefits and the terms and conditions of the Secure Income Annuity and GLWB Rider. "]

{"sheet":"T10S","index":2,"n_rows":40,"n_cols":49,"rows_kept":40,"cut":false,"hidden":true,"merged":[]}
[{"$f":"IFERROR(VLOOKUP(Age,T10S,MATCH(Defer+1,$B$1:$W$1,1)+1,FALSE)/100000,0)","v":8.6580000000000004E-2},1,{"$f":"B1+1","v":2},{"$f":"C1+1","v":3},4,5,6,7,8,9,10,11,12,13,14,15,16,17,18,19,20,25,30,null,null,null,"Issue\nAge","year 1","year 2","year 3","year 4","year 5","year 6","year 7","year 8","year 9","year 10","year 11","year 12","year 13","year 14","year 15","year 16","year 17","year 18","year 19","year 20","year 25","year 30"]
[40,null,null,null,null,null,null,null,null,null,null,7002,7177,7356,7540,7728,7922,8040,8161,8283,8408,8851,9444,null,null,null,40,null,null,null,null,null,null,null,null,null,null,7002,7177,7356,7540,7728,7922,8040,8161,8283,8408,8851,9444]
[41,null,null,null,null,null,null,null,null,null,6681,7058,7234,7415,7601,7791,7985,8105,8227,8350,8475,8950,9596,null,null,null,41,null,null,null,null,null,null,null,null,null,6681,7058,7234,7415,7601,7791,7985,8105,8227,8350,8475,8950,9596]
[42,null,null,null,null,null,null,null,null,6380,6737,7120,7298,7480,7667,7859,8055,8176,8299,8423,8550,9058,9760,null,null,null,42,null,null,null,null,null,null,null,null,6380,6737,7120,7298,7480,7667,7859,8055,8176,8299,8423,8550,9058,9760]
[43,null,null,null,null,null,null,null,6096,6435,6798,7188,7367,7551,7740,7934,8132,8254,8378,8504,8631,9176,9937,null,null,null,43,null,null,null,null,null,null,null,6096,6435,6798,7188,7367,7551,7740,7934,8132,8254,8378,8504,8631,9176,9937]
[44,null,null,null,null,null,null,5828,6150,6495,6865,7262,7443,7630,7820,8016,8216,8339,8464,8591,8720,9305,10127,null,null,null,44,null,null,null,null,null,null,5828,6150,6495,6865,7262,7443,7630,7820,8016,8216,8339,8464,8591,8720,9305,10127]
[45,null,null,null,null,null,5710,5959,6209,6560,6938,7343,7527,7715,7908,8105,8308,8433,8559,8688,8818,9444,10332,null,null,null,45,null,null,null,null,null,5710,5959,6209,6560,6938,7343,7527,7715,7908,8105,8308,8433,8559,8688,8818,9444,10332]
[46,null,null,null,null,5464,5763,6018,6273,6632,7017,7432,7618,7808,8003,8203,8409,8535,8663,8793,8925,9596,10553,null,null,null,46,null,null,null,null,5464,5763,6018,6273,6632,7017,7432,7618,7808,8003,8203,8409,8535,8663,8793,8925,9596,10553]
[47,null,null,null,5283,5516,5821,6082,6343,6710,7104,7529,7717,7910,8108,8310,8518,8646,8776,8907,9041,9760,10789,null,null,null,47,null,null,null,5283,5516,5821,6082,6343,6710,7104,7529,7717,7910,8108,8310,8518,8646,8776,8907,9041,9760,10789]
[48,null,null,5008,5334,5572,5883,6151,6419,6794,7198,7634,7825,8021,8221,8427,8637,8767,8898,9032,9167,9937,11043,null,null,null,48,null,null,5008,5334,5572,5883,6151,6419,6794,7198,7634,7825,8021,8221,8427,8637,8767,8898,9032,9167,9937,11043]
[49,null,4726,5057,5388,5632,5951,6226,6501,6886,7301,7749,7942,8141,8344,8553,8767,8898,9032,9167,9305,10127,11313,null,null,null,49,null,4726,5057,5388,5632,5951,6226,6501,6886,7301,7749,7942,8141,8344,8553,8767,8898,9032,9167,9305,10127,11313]
[50,4126,4772,5109,5447,5697,6023,6307,6590,6985,7412,7873,8070,8271,8478,8690,8907,9041,9177,9314,9454,10332,11602,null,null,null,50,4126,4772,5109,5447,5697,6023,6307,6590,6985,7412,7873,8070,8271,8478,8690,8907,9041,9177,9314,9454,10332,11602]
[51,4233,4822,5165,5510,5767,6101,6393,6685,7092,7532,8007,8207,8413,8623,8839,9060,9195,9333,9473,9615,10553,11910,null,null,null,51,4233,4822,5165,5510,5767,6101,6393,6685,7092,7532,8007,8207,8413,8623,8839,9060,9195,9333,9473,9615,10553,11910]
[52,4339,4874,5225,5578,5842,6185,6487,6788,7207,7661,8153,8356,8565,8779,8999,9224,9362,9503,9645,9790,10789,12240,null,null,null,52,4339,4874,5225,5578,5842,6185,6487,6788,7207,7661,8153,8356,8565,8779,8999,9224,9362,9503,9645,9790,10789,12240]
[53,4446,4930,5288,5650,5922,6275,6587,6898,7331,7800,8309,8517,8730,8948,9172,9401,9542,9685,9830,9978,11043,12591,null,null,null,53,4446,4930,5288,5650,5922,6275,6587,6898,7331,7800,8309,8517,8730,8948,9172,9401,9542,9685,9830,9978,11043,12591]
[54,4552,4989,5356,5727,6008,6371,6694,7016,7464,7949,8477,8689,8906,9129,9357,9591,9735,9881,10029,10180,11313,12964,null,null,null,54,4552,4989,5356,5727,6008,6371,6694,7016,7464,7949,8477,8689,8906,9129,9357,9591,9735,9881,10029,10180,11313,12964]
[55,4659,5051,5427,5808,6098,6473,6808,7143,7606,8110,8658,8874,9096,9324,9557,9796,9943,10092,10243,10397,11602,13360,null,null,null,55,4659,5051,5427,5808,6098,6473,6808,7143,7606,8110,8658,8874,9096,9324,9557,9796,9943,10092,10243,10397,11602,13360]
[56,4766,5168,5558,5953,6194,6581,6929,7277,7758,8281,8852,9073,9300,9533,9771,10015,10165,10318,10473,10630,11910,13785,null,null,null,56,4766,5168,5558,5953,6194,6581,6929,7277,7758,8281,8852,9073,9300,9533,9771,10015,10165,10318,10473,10630,11910,13785]
[57,4872,5238,5638,6045,6296,6696,7058,7420,7920,8464,9060,9286,9518,9756,10000,10250,10404,10560,10719,10879,12240,14235,null,null,null,57,4872,5238,5638,6045,6296,6696,7058,7420,7920,8464,9060,9286,9518,9756,10000,10250,10404,10560,10719,10879,12240,14235]
[58,4974,5312,5723,6142,6404,6818,7195,7573,8092,8660,9282,9514,9752,9995,10245,10501,10659,10819,10981,11146,12591,14713,null,null,null,58,4974,5312,5723,6142,6404,6818,7195,7573,8092,8660,9282,9514,9752,9995,10245,10501,10659,10819,10981,11146,12591,14713]
[59,5075,5389,5812,6244,6517,6947,7341,7734,8276,8868,9519,9757,10001,10251,10507,10769,10931,11095,11261,11430,12964,15036,null,null,null,59,5075,5389,5812,6244,6517,6947,7341,7734,8276,8868,9519,9757,10001,10251,10507,10769,10931,11095,11261,11430,12964,15036]
[60,5177,5469,5905,6351,6636,7082,7494,7906,8471,9091,9772,10016,10267,10523,10786,11056,11222,11390,11561,11734,13360,15359,null,null,null,60,5177,5469,5905,6351,6636,7082,7494,7906,8471,9091,9772,10016,10267,10523,10786,11056,11222,11390,11561,11734,13360,15359]
[61,5278,5553,6002,6463,6762,7225,7656,8087,8677,9327,10042,10293,10551,10814,11085,11362,11532,11705,11881,12059,13785,15755,null,null,null,61,5278,5553,6002,6463,6762,7225,7656,8087,8677,9327,10042,10293,10551,10814,11085,11362,11532,11705,11881,12059,13785,15755]
[62,5380,5640,6104,6581,6894,7376,7827,8279,8896,9577,10330,10588,10853,11124,11402,11688,11863,12041,12221,12405,14235,16151,null,null,null,62,5380,5640,6104,6581,6894,7376,7827,8279,8896,9577,10330,10588,10853,11124,11402,11688,11863,12041,12221,12405,14235,16151]
[63,5451,5731,6209,6703,7032,7534,8008,8481,9129,9844,10636,10902,11174,11454,11740,12034,12214,12397,12583,12772,14713,16516,null,null,null,63,5451,5731,6209,6703,7032,7534,8008,8481,9129,9844,10636,10902,11174,11454,11740,12034,12214,12397,12583,12772,14713,16516]
[64,5522,5824,6319,6831,7175,7699,8197,8695,9375,10127,10962,11236,11517,11804,12100,12402,12588,12777,12969,13163,15036,16684,null,null,null,64,5522,5824,6319,6831,7175,7699,8197,8695,9375,10127,10962,11236,11517,11804,12100,12402,12588,12777,12969,13163,15036,16684]
[65,5593,5921,6433,6964,7326,7873,8396,8920,9634,10427,11310,11592,11882,12179,12484,12796,12988,13183,13380,13581,15359,16851,null,null,null,65,5593,5921,6433,6964,7326,7873,8396,8920,9634,10427,11310,11592,11882,12179,12484,12796,12988,13183,13380,13581,15359,16851]
[66,5664,6020,6551,7103,7484,8056,8606,9157,9908,10745,11679,11971,12271,12577,12892,13214,13412,13613,13818,14025,15755,16936,null,null,null,66,5664,6020,6551,7103,7484,8056,8606,9157,9908,10745,11679,11971,12271,12577,12892,13214,13412,13613,13818,14025,15755,16936]
[67,5735,6123,6673,7246,7648,8246,8827,9408,10199,11081,12071,12373,12682,13000,13325,13658,13863,14070,14281,14496,16151,17020,null,null,null,67,5735,6123,6673,7246,7648,8246,8827,9408,10199,11081,12071,12373,12682,13000,13325,13658,13863,14070,14281,14496,16151,17020]
[68,5741,6230,6801,7398,7822,8449,9039,9628,10461,11392,12336,12645,12961,13285,13617,13957,14167,14379,14595,14814,16516,17105,null,null,null,68,5741,6230,6801,7398,7822,8449,9039,9628,10461,11392,12336,12645,12961,13285,13617,13957,14167,14379,14595,14814,16516,17105]
[69,5747,6336,6929,7550,7996,8652,9250,9849,10722,11703,12601,12916,13239,13570,13909,14257,14471,14688,14908,15132,16684,17191,null,null,null,69,5747,6336,6929,7550,7996,8652,9250,9849,10722,11703,12601,12916,13239,13570,13909,14257,14471,14688,14908,15132,16684,17191]
[70,5753,6447,7063,7711,8181,8870,9504,10138,11060,12100,12926,13249,13580,13920,14268,14625,14844,15067,15293,15522,16851,17260,null,null,null,70,5753,6447,7063,7711,8181,8870,9504,10138,11060,12100,12926,13249,13580,13920,14268,14625,14844,15067,15293,15522,16851,17260]
[71,5759,6560,7201,7876,8373,9097,9769,10442,11419,12335,13251,13582,13922,14270,14626,14992,15217,15445,15677,15912,16936,17328,null,null,null,71,5759,6560,7201,7876,8373,9097,9769,10442,11419,12335,13251,13582,13922,14270,14626,14992,15217,15445,15677,15912,16936,17328]
[72,5765,6676,7342,8046,8572,9332,10047,10761,11797,12674,13550,13889,14236,14592,14957,15331,15561,15794,16031,16272,17020,17328,null,null,null,72,5765,6676,7342,8046,8572,9332,10047,10761,11797,12674,13550,13889,14236,14592,14957,15331,15561,15794,16031,16272,17020,17328]
[73,5786,6793,7488,8225,8783,9584,10235,10992,12081,12884,13688,14030,14381,14740,15109,15487,15719,15955,16194,16437,17105,17328,null,null,null,73,5786,6793,7488,8225,8783,9584,10235,10992,12081,12884,13688,14030,14381,14740,15109,15487,15719,15955,16194,16437,17105,17328]
[74,5806,6910,7634,8404,8993,9835,10424,11222,12364,13095,13826,14171,14526,14889,15261,15642,15877,16115,16357,16602,17191,17328,null,null,null,74,5806,6910,7634,8404,8993,9835,10424,11222,12364,13095,13826,14171,14526,14889,15261,15642,15877,16115,16357,16602,17191,17328]
[75,5826,6944,7672,8446,9038,9884,10476,11278,12426,13160,13895,14242,14598,14963,15337,15721,15957,16196,16439,16685,17260,17328,null,null,null,75,5826,6944,7672,8446,9038,9884,10476,11278,12426,13160,13895,14242,14598,14963,15337,15721,15957,16196,16439,16685,17260,17328]
[76,5847,6979,7711,8488,9083,9934,10529,11334,12488,13226,13964,14313,14671,15038,15414,15799,16036,16277,16521,16769,17328,17328,null,null,null,76,5847,6979,7711,8488,9083,9934,10529,11334,12488,13226,13964,14313,14671,15038,15414,15799,16036,16277,16521,16769,17328,17328]
[77,5867,7014,7749,8531,9129,9983,10581,11391,12550,13292,14034,14385,14745,15113,15491,15878,16116,16358,16604,16853,17328,17328,null,null,null,77,5867,7014,7749,8531,9129,9983,10581,11391,12550,13292,14034,14385,14745,15113,15491,15878,16116,16358,16604,16853,17328,17328]
[78,5888,7049,7788,8574,9174,10033,10634,11448,12613,13359,14104,14457,14818,15189,15568,15958,16197,16440,16687,16937,17328,17328,null,null,null,78,5888,7049,7788,8574,9174,10033,10634,11448,12613,13359,14104,14457,14818,15189,15568,15958,16197,16440,16687,16937,17328,17328]

{"sheet":"T10J","index":3,"n_rows":40,"n_cols":50,"rows_kept":40,"cut":false,"hidden":true,"merged":[]}
[{"$f":"IFERROR(VLOOKUP(Age,T10J,MATCH(Defer+1,$B$1:$W$1,1)+1,FALSE)/100000,0)","v":7.7920000000000003E-2},1,{"$f":"B1+1","v":2},{"$f":"C1+1","v":3},4,5,6,7,8,9,10,11,12,13,14,15,16,17,18,19,20,25,30,null,null,null,null,"Issue\nAge","year 1","year 2","year 3","year 4","year 5","year 6","year 7","year 8","year 9","year 10","year 11","year 12","year 13","year 14","year 15","year 16","year 17","year 18","year 19","year 20","year 25","year 30"]
[40,null,null,null,null,null,null,null,null,null,null,6001,6151,6305,6463,6624,6931,7035,7141,7248,7357,7868,8500,null,null,null,null,40,null,null,null,null,null,null,null,null,null,null,6001,6151,6305,6463,6624,6931,7035,7141,7248,7357,7868,8500]
[41,null,null,null,null,null,null,null,null,null,5727,6050,6201,6356,6515,6817,6987,7092,7198,7306,7534,8055,8682,null,null,null,null,41,null,null,null,null,null,null,null,null,null,5727,6050,6201,6356,6515,6817,6987,7092,7198,7306,7534,8055,8682]
[42,null,null,null,null,null,null,null,null,5468,5774,6103,6255,6412,6709,6877,7048,7154,7261,7487,7600,8153,8830,null,null,null,null,42,null,null,null,null,null,null,null,null,5468,5774,6103,6255,6412,6709,6877,7048,7154,7261,7487,7600,8153,8830]
[43,null,null,null,null,null,null,null,5225,5515,5827,6161,6315,6608,6773,6942,7116,7222,7447,7559,7672,8259,8990,null,null,null,null,43,null,null,null,null,null,null,null,5225,5515,5827,6161,6315,6608,6773,6942,7116,7222,7447,7559,7672,8259,8990]
[44,null,null,null,null,null,null,4995,5271,5567,5884,6224,6513,6676,6843,7014,7189,7413,7524,7637,7751,8374,9163,null,null,null,null,44,null,null,null,null,null,null,4995,5271,5567,5884,6224,6513,6676,6843,7014,7189,7413,7524,7637,7751,8374,9163]
[45,null,null,null,null,null,4894,5108,5322,5623,5947,6425,6586,6751,6919,7092,7385,7496,7608,7722,7838,8500,9348,null,null,null,null,45,null,null,null,null,null,4894,5108,5322,5623,5947,6425,6586,6751,6919,7092,7385,7496,7608,7722,7838,8500,9348]
[46,null,null,null,null,4683,4940,5158,5377,5684,6140,6503,6666,6832,7003,7292,7474,7586,7700,7816,8032,8682,9593,null,null,null,null,46,null,null,null,null,4683,4940,5158,5377,5684,6140,6503,6666,6832,7003,7292,7474,7586,7700,7816,8032,8682,9593]
[47,null,null,null,4528,4728,4989,5213,5437,5871,6216,6588,6752,6921,7207,7387,7572,7685,7800,8016,8137,8830,9808,null,null,null,null,47,null,null,null,4528,4728,4989,5213,5437,5871,6216,6588,6752,6921,7207,7387,7572,7685,7800,8016,8137,8830,9808]
[48,null,null,4293,4572,4776,5043,5272,5617,5945,6298,6680,6847,7129,7308,7490,7678,7793,8008,8129,8251,8990,10039,null,null,null,null,48,null,null,4293,4572,4776,5043,5272,5617,5945,6298,6680,6847,7129,7308,7490,7678,7793,8008,8129,8251,8990,10039]
[49,null,4051,4335,4619,4828,5101,5448,5688,6025,6388,6780,7060,7236,7417,7603,7793,8008,8129,8251,8374,9163,10285,null,null,null,null,49,null,4051,4335,4619,4828,5101,5448,5688,6025,6388,6780,7060,7236,7417,7603,7793,8008,8129,8251,8374,9163,10285]
[50,3537,4091,4379,4669,4884,5270,5518,5766,6112,6485,6998,7173,7352,7536,7724,8017,8137,8259,8383,8508,9348,10547,null,null,null,null,50,3537,4091,4379,4669,4884,5270,5518,5766,6112,6485,6998,7173,7352,7536,7724,8017,8137,8259,8383,8508,9348,10547]
[51,3628,4133,4427,4723,5046,5339,5594,5850,6206,6695,7118,7296,7478,7665,7955,8154,8276,8400,8526,8700,9593,10918,null,null,null,null,51,3628,4133,4427,4723,5046,5339,5594,5850,6206,6695,7118,7296,7478,7665,7955,8154,8276,8400,8526,8700,9593,10918]
[52,3719,4178,4478,4881,5112,5412,5676,5939,6406,6810,7247,7428,7614,7901,8099,8302,8426,8552,8727,8858,9808,11220,null,null,null,null,52,3719,4178,4478,4881,5112,5412,5676,5939,6406,6810,7247,7428,7614,7901,8099,8302,8426,8552,8727,8858,9808,11220]
[53,3811,4225,4627,4944,5182,5491,5763,6132,6516,6933,7386,7570,7857,8053,8254,8461,8588,8763,8894,9028,10039,11542,null,null,null,null,53,3811,4225,4627,4944,5182,5491,5763,6132,6516,6933,7386,7570,7857,8053,8254,8461,8588,8763,8894,9028,10039,11542]
[54,3902,4365,4686,5011,5257,5575,5950,6237,6635,7066,7535,7820,8016,8216,8422,8632,8808,8940,9074,9210,10285,11883,null,null,null,null,54,3902,4365,4686,5011,5257,5575,5950,6237,6635,7066,7535,7820,8016,8216,8422,8632,8808,8940,9074,9210,10285,11883]
[55,4077,4420,4749,5082,5336,5754,6051,6349,6761,7209,7792,7987,8187,8391,8601,8863,8996,9131,9268,9407,10547,12247,null,null,null,null,55,4077,4420,4749,5082,5336,5754,6051,6349,6761,7209,7792,7987,8187,8391,8601,8863,8996,9131,9268,9407,10547,12247]
[56,4170,4522,4863,5209,5506,5850,6159,6468,6896,7453,7967,8166,8370,8579,8840,9061,9197,9335,9475,9663,10918,12682,null,null,null,null,56,4170,4522,4863,5209,5506,5850,6159,6468,6896,7453,7967,8166,8370,8579,8840,9061,9197,9335,9475,9663,10918,12682]
[57,4263,4584,4934,5373,5597,5952,6274,6596,7128,7618,8154,8358,8567,8827,9048,9274,9413,9554,9744,9890,11220,13096,null,null,null,null,57,4263,4584,4934,5373,5597,5952,6274,6596,7128,7618,8154,8358,8567,8827,9048,9274,9413,9554,9744,9890,11220,13096]
[58,4352,4648,5087,5460,5692,6060,6396,6815,7283,7794,8354,8562,8823,9043,9270,9501,9644,9835,9983,10133,11542,13536,null,null,null,null,58,4352,4648,5087,5460,5692,6060,6396,6815,7283,7794,8354,8562,8823,9043,9270,9501,9644,9835,9983,10133,11542,13536]
[59,4441,4790,5166,5550,5793,6175,6606,6961,7448,7981,8567,8827,9048,9274,9506,9744,9937,10086,10238,10391,11883,13833,null,null,null,null,59,4441,4790,5166,5550,5793,6175,6606,6961,7448,7981,8567,8827,9048,9274,9506,9744,9937,10086,10238,10391,11883,13833]
[60,4601,4862,5249,5645,5899,6374,6745,7115,7624,8182,8841,9062,9289,9521,9759,10051,10202,10355,10510,10668,12247,14130,null,null,null,null,60,4601,4862,5249,5645,5899,6374,6745,7115,7624,8182,8841,9062,9289,9521,9759,10051,10202,10355,10510,10668,12247,14130]
[61,4692,4936,5335,5745,6086,6503,6890,7278,7810,8439,9086,9313,9546,9785,10077,10329,10484,10641,10801,11054,12682,14543,null,null,null,null,61,4692,4936,5335,5745,6086,6503,6890,7278,7810,8439,9086,9313,9546,9785,10077,10329,10484,10641,10801,11054,12682,14543]
[62,4782,5014,5426,5923,6204,6638,7045,7451,8049,8665,9346,9580,9819,10113,10366,10625,10784,10946,11203,11371,13096,14908,null,null,null,null,62,4782,5014,5426,5923,6204,6638,7045,7451,8049,8665,9346,9580,9819,10113,10366,10625,10784,10946,11203,11371,13096,14908]
[63,4845,5094,5589,6033,6328,6781,7207,7674,8260,8906,9623,9864,10159,10412,10673,10940,11104,11364,11535,11708,13536,15245,null,null,null,null,63,4845,5094,5589,6033,6328,6781,7207,7674,8260,8906,9623,9864,10159,10412,10673,10940,11104,11364,11535,11708,13536,15245]
[64,4908,5242,5687,6148,6458,6929,7416,7867,8482,9163,9918,10214,10470,10731,11000,11275,11539,11712,11888,12066,13833,15400,null,null,null,null,64,4908,5242,5687,6148,6458,6929,7416,7867,8482,9163,9918,10214,10470,10731,11000,11275,11539,11712,11888,12066,13833,15400]
[65,5034,5329,5790,6268,6594,7123,7597,8070,8717,9434,10281,10538,10802,11072,11349,11729,11905,12084,12265,12449,14130,15555,null,null,null,null,65,5034,5329,5790,6268,6594,7123,7597,8070,8717,9434,10281,10538,10802,11072,11349,11729,11905,12084,12265,12449,14130,15555]
[66,5097,5418,5896,6392,6771,7288,7787,8285,8965,9768,10618,10883,11155,11434,11817,12113,12295,12479,12666,12903,14543,15633,null,null,null,null,66,5097,5418,5896,6392,6771,7288,7787,8285,8965,9768,10618,10883,11155,11434,11817,12113,12295,12479,12666,12903,14543,15633]
[67,5161,5511,6006,6556,6919,7460,7986,8512,9272,10074,10974,11248,11530,11916,12214,12520,12707,12898,13139,13336,14908,15711,null,null,null,null,67,5161,5511,6006,6556,6919,7460,7986,8512,9272,10074,10974,11248,11530,11916,12214,12520,12707,12898,13139,13336,14908,15711]
[68,5167,5607,6153,6694,7077,7644,8178,8753,9510,10357,11215,11495,11881,12178,12482,12794,12986,13229,13427,13629,15245,15790,null,null,null,null,68,5167,5607,6153,6694,7077,7644,8178,8753,9510,10357,11215,11495,11881,12178,12482,12794,12986,13229,13427,13629,15245,15790]
[69,5172,5733,6269,6831,7234,7828,8409,8953,9748,10639,11456,11840,12136,12439,12750,13069,13313,13513,13716,13921,15400,15869,null,null,null,null,69,5172,5733,6269,6831,7234,7828,8409,8953,9748,10639,11456,11840,12136,12439,12750,13069,13313,13513,13716,13921,15400,15869]
[70,5205,5833,6390,6976,7402,8064,8640,9216,10055,11000,11849,12145,12449,12760,13079,13455,13656,13861,14069,14280,15555,15932,null,null,null,null,70,5205,5833,6390,6976,7402,8064,8640,9216,10055,11000,11849,12145,12449,12760,13079,13455,13656,13861,14069,14280,15555,15932]
[71,5211,5936,6515,7126,7612,8270,8881,9493,10381,11307,12146,12450,12761,13080,13456,13793,13999,14209,14423,14688,15633,15995,null,null,null,null,71,5211,5936,6515,7126,7612,8270,8881,9493,10381,11307,12146,12450,12761,13080,13456,13793,13999,14209,14423,14688,15633,15995]
[72,5216,6040,6643,7315,7793,8484,9133,9783,10814,11618,12421,12732,13050,13425,13760,14104,14316,14531,14798,15020,15711,15995,null,null,null,null,72,5216,6040,6643,7315,7793,8484,9133,9783,10814,11618,12421,12732,13050,13425,13760,14104,14316,14531,14798,15020,15711,15995]
[73,5235,6146,6807,7477,7984,8712,9305,10076,11074,11811,12547,12861,13230,13561,13900,14248,14461,14727,14948,15173,15790,15995,null,null,null,null,73,5235,6146,6807,7477,7984,8712,9305,10076,11074,11811,12547,12861,13230,13561,13900,14248,14461,14727,14948,15173,15790,15995]
[74,5253,6282,6940,7640,8176,8941,9556,10287,11334,12004,12674,13038,13364,13698,14040,14391,14656,14876,15099,15325,15869,15995,null,null,null,null,74,5253,6282,6940,7640,8176,8941,9556,10287,11334,12004,12674,13038,13364,13698,14040,14391,14656,14876,15099,15325,15869,15995]
[75,5297,6313,6975,7678,8217,9061,9603,10338,11390,12064,12783,13103,13430,13766,14110,14511,14729,14950,15174,15402,15932,15995,null,null,null,null,75,5297,6313,6975,7678,8217,9061,9603,10338,11390,12064,12783,13103,13430,13766,14110,14511,14729,14950,15174,15402,15932,15995]
[76,5315,6345,7010,7717,8326,9106,9651,10390,11447,12168,12847,13168,13498,13835,14228,14584,14803,15025,15250,15479,15995,15995,null,null,null,null,76,5315,6345,7010,7717,8326,9106,9651,10390,11447,12168,12847,13168,13498,13835,14228,14584,14803,15025,15250,15479,15995,15995]
[77,5334,6376,7045,7820,8368,9151,9700,10442,11546,12229,12911,13234,13565,13951,14299,14657,14877,15100,15326,15556,15995,15995,null,null,null,null,77,5334,6376,7045,7820,8368,9151,9700,10442,11546,12229,12911,13234,13565,13951,14299,14657,14877,15100,15326,15556,15995,15995]
[78,5352,6408,7139,7859,8410,9197,9748,10532,11604,12290,12976,13300,13678,14020,14371,14730,14951,15175,15403,15634,15995,15995,null,null,null,null,78,5352,6408,7139,7859,8410,9197,9748,10532,11604,12290,12976,13300,13678,14020,14371,14730,14951,15175,15403,15634,15995,15995]

{"sheet":"T15S","index":4,"n_rows":36,"n_cols":49,"rows_kept":36,"cut":false,"hidden":true,"merged":[]}
[{"$f":"IFERROR(VLOOKUP(Age,T15S,MATCH(Defer+1,$B$1:$W$1,1)+1,FALSE)/100000,0)","v":8.6580000000000004E-2},1,{"$f":"B1+1","v":2},{"$f":"C1+1","v":3},4,5,6,7,8,9,10,11,12,13,14,15,16,17,18,19,20,25,30]
[40,null,null,null,null,null,null,null,null,null,null,7002,7177,7356,7540,7728,7922,8040,8161,8283,8408,8851,9444,null,null,null,"Issue\nAge","year 1","year 2","year 3","year 4","year 5","year 6","year 7","year 8","year 9","year 10","year 11","year 12","year 13","year 14","year 15","year 16","year 17","year 18","year 19","year 20","year 25","year 30"]
[41,null,null,null,null,null,null,null,null,null,6681,7058,7234,7415,7601,7791,7985,8105,8227,8350,8475,8950,9596,null,null,null,40,null,null,null,null,null,null,null,null,null,null,7002,7177,7356,7540,7728,7922,8040,8161,8283,8408,8851,9444]
[42,null,null,null,null,null,null,null,null,6380,6737,7120,7298,7480,7667,7859,8055,8176,8299,8423,8550,9058,9760,null,null,null,41,null,null,null,null,null,null,null,null,null,6681,7058,7234,7415,7601,7791,7985,8105,8227,8350,8475,8950,9596]
[43,null,null,null,null,null,null,null,6096,6435,6798,7188,7367,7551,7740,7934,8132,8254,8378,8504,8631,9176,9937,null,null,null,42,null,null,null,null,null,null,null,null,6380,6737,7120,7298,7480,7667,7859,8055,8176,8299,8423,8550,9058,9760]
[44,null,null,null,null,null,null,5828,6150,6495,6865,7262,7443,7630,7820,8016,8216,8339,8464,8591,8720,9305,10127,null,null,null,43,null,null,null,null,null,null,null,6096,6435,6798,7188,7367,7551,7740,7934,8132,8254,8378,8504,8631,9176,9937]
[45,null,null,null,null,null,5710,5959,6209,6560,6938,7343,7527,7715,7908,8105,8308,8433,8559,8688,8818,9444,10332,null,null,null,44,null,null,null,null,null,null,5828,6150,6495,6865,7262,7443,7630,7820,8016,8216,8339,8464,8591,8720,9305,10127]
[46,null,null,null,null,5464,5763,6018,6273,6632,7017,7432,7618,7808,8003,8203,8409,8535,8663,8793,8925,9596,10553,null,null,null,45,null,null,null,null,null,5710,5959,6209,6560,6938,7343,7527,7715,7908,8105,8308,8433,8559,8688,8818,9444,10332]
[47,null,null,null,5283,5516,5821,6082,6343,6710,7104,7529,7717,7910,8108,8310,8518,8646,8776,8907,9041,9760,10789,null,null,null,46,null,null,null,null,5464,5763,6018,6273,6632,7017,7432,7618,7808,8003,8203,8409,8535,8663,8793,8925,9596,10553]
[48,null,null,5008,5334,5572,5883,6151,6419,6794,7198,7634,7825,8021,8221,8427,8637,8767,8898,9032,9167,9937,11043,null,null,null,47,null,null,null,5283,5516,5821,6082,6343,6710,7104,7529,7717,7910,8108,8310,8518,8646,8776,8907,9041,9760,10789]
[49,null,4726,5057,5388,5632,5951,6226,6501,6886,7301,7749,7942,8141,8344,8553,8767,8898,9032,9167,9305,10127,11313,null,null,null,48,null,null,5008,5334,5572,5883,6151,6419,6794,7198,7634,7825,8021,8221,8427,8637,8767,8898,9032,9167,9937,11043]
[50,4126,4772,5109,5447,5697,6023,6307,6590,6985,7412,7873,8070,8271,8478,8690,8907,9041,9177,9314,9454,10332,11602,null,null,null,49,null,4726,5057,5388,5632,5951,6226,6501,6886,7301,7749,7942,8141,8344,8553,8767,8898,9032,9167,9305,10127,11313]
[51,4233,4822,5165,5510,5767,6101,6393,6685,7092,7532,8007,8207,8413,8623,8839,9060,9195,9333,9473,9615,10553,11910,null,null,null,50,4126,4772,5109,5447,5697,6023,6307,6590,6985,7412,7873,8070,8271,8478,8690,8907,9041,9177,9314,9454,10332,11602]
[52,4339,4874,5225,5578,5842,6185,6487,6788,7207,7661,8153,8356,8565,8779,8999,9224,9362,9503,9645,9790,10789,12240,null,null,null,51,4233,4822,5165,5510,5767,6101,6393,6685,7092,7532,8007,8207,8413,8623,8839,9060,9195,9333,9473,9615,10553,11910]
[53,4446,4930,5288,5650,5922,6275,6587,6898,7331,7800,8309,8517,8730,8948,9172,9401,9542,9685,9830,9978,11043,12591,null,null,null,52,4339,4874,5225,5578,5842,6185,6487,6788,7207,7661,8153,8356,8565,8779,8999,9224,9362,9503,9645,9790,10789,12240]
[54,4552,4989,5356,5727,6008,6371,6694,7016,7464,7949,8477,8689,8906,9129,9357,9591,9735,9881,10029,10180,11313,12964,null,null,null,53,4446,4930,5288,5650,5922,6275,6587,6898,7331,7800,8309,8517,8730,8948,9172,9401,9542,9685,9830,9978,11043,12591]
[55,4659,5051,5427,5808,6098,6473,6808,7143,7606,8110,8658,8874,9096,9324,9557,9796,9943,10092,10243,10397,11602,13360,null,null,null,54,4552,4989,5356,5727,6008,6371,6694,7016,7464,7949,8477,8689,8906,9129,9357,9591,9735,9881,10029,10180,11313,12964]
[56,4766,5168,5558,5953,6194,6581,6929,7277,7758,8281,8852,9073,9300,9533,9771,10015,10165,10318,10473,10630,11910,13785,null,null,null,55,4659,5051,5427,5808,6098,6473,6808,7143,7606,8110,8658,8874,9096,9324,9557,9796,9943,10092,10243,10397,11602,13360]
[57,4872,5238,5638,6045,6296,6696,7058,7420,7920,8464,9060,9286,9518,9756,10000,10250,10404,10560,10719,10879,12240,14235,null,null,null,56,4766,5168,5558,5953,6194,6581,6929,7277,7758,8281,8852,9073,9300,9533,9771,10015,10165,10318,10473,10630,11910,13785]
[58,4974,5312,5723,6142,6404,6818,7195,7573,8092,8660,9282,9514,9752,9995,10245,10501,10659,10819,10981,11146,12591,14713,null,null,null,57,4872,5238,5638,6045,6296,6696,7058,7420,7920,8464,9060,9286,9518,9756,10000,10250,10404,10560,10719,10879,12240,14235]
[59,5075,5389,5812,6244,6517,6947,7341,7734,8276,8868,9519,9757,10001,10251,10507,10769,10931,11095,11261,11430,12964,15036,null,null,null,58,4974,5312,5723,6142,6404,6818,7195,7573,8092,8660,9282,9514,9752,9995,10245,10501,10659,10819,10981,11146,12591,14713]
[60,5177,5469,5905,6351,6636,7082,7494,7906,8471,9091,9772,10016,10267,10523,10786,11056,11222,11390,11561,11734,13360,15359,null,null,null,59,5075,5389,5812,6244,6517,6947,7341,7734,8276,8868,9519,9757,10001,10251,10507,10769,10931,11095,11261,11430,12964,15036]
[61,5278,5553,6002,6463,6762,7225,7656,8087,8677,9327,10042,10293,10551,10814,11085,11362,11532,11705,11881,12059,13785,15755,null,null,null,60,5177,5469,5905,6351,6636,7082,7494,7906,8471,9091,9772,10016,10267,10523,10786,11056,11222,11390,11561,11734,13360,15359]
[62,5380,5640,6104,6581,6894,7376,7827,8279,8896,9577,10330,10588,10853,11124,11402,11688,11863,12041,12221,12405,14235,16151,null,null,null,61,5278,5553,6002,6463,6762,7225,7656,8087,8677,9327,10042,10293,10551,10814,11085,11362,11532,11705,11881,12059,13785,15755]
[63,5451,5731,6209,6703,7032,7534,8008,8481,9129,9844,10636,10902,11174,11454,11740,12034,12214,12397,12583,12772,14713,16516,null,null,null,62,5380,5640,6104,6581,6894,7376,7827,8279,8896,9577,10330,10588,10853,11124,11402,11688,11863,12041,12221,12405,14235,16151]
[64,5522,5824,6319,6831,7175,7699,8197,8695,9375,10127,10962,11236,11517,11804,12100,12402,12588,12777,12969,13163,15036,16684,null,null,null,63,5451,5731,6209,6703,7032,7534,8008,8481,9129,9844,10636,10902,11174,11454,11740,12034,12214,12397,12583,12772,14713,16516]
[65,5593,5921,6433,6964,7326,7873,8396,8920,9634,10427,11310,11592,11882,12179,12484,12796,12988,13183,13380,13581,15359,16851,null,null,null,64,5522,5824,6319,6831,7175,7699,8197,8695,9375,10127,10962,11236,11517,11804,12100,12402,12588,12777,12969,13163,15036,16684]
[66,5664,6020,6551,7103,7484,8056,8606,9157,9908,10745,11679,11971,12271,12577,12892,13214,13412,13613,13818,14025,15755,16936,null,null,null,65,5593,5921,6433,6964,7326,7873,8396,8920,9634,10427,11310,11592,11882,12179,12484,12796,12988,13183,13380,13581,15359,16851]
[67,5735,6123,6673,7246,7648,8246,8827,9408,10199,11081,12071,12373,12682,13000,13325,13658,13863,14070,14281,14496,16151,17020,null,null,null,66,5664,6020,6551,7103,7484,8056,8606,9157,9908,10745,11679,11971,12271,12577,12892,13214,13412,13613,13818,14025,15755,16936]
[68,5741,6230,6801,7398,7822,8449,9039,9628,10461,11392,12336,12645,12961,13285,13617,13957,14167,14379,14595,14814,16516,17105,null,null,null,67,5735,6123,6673,7246,7648,8246,8827,9408,10199,11081,12071,12373,12682,13000,13325,13658,13863,14070,14281,14496,16151,17020]
[69,5747,6336,6929,7550,7996,8652,9250,9849,10722,11703,12601,12916,13239,13570,13909,14257,14471,14688,14908,15132,16684,17191,null,null,null,68,5741,6230,6801,7398,7822,8449,9039,9628,10461,11392,12336,12645,12961,13285,13617,13957,14167,14379,14595,14814,16516,17105]
[70,5753,6447,7063,7711,8181,8870,9504,10138,11060,12100,12926,13249,13580,13920,14268,14625,14844,15067,15293,15522,16851,17260,null,null,null,69,5747,6336,6929,7550,7996,8652,9250,9849,10722,11703,12601,12916,13239,13570,13909,14257,14471,14688,14908,15132,16684,17191]
[71,5759,6560,7201,7876,8373,9097,9769,10442,11419,12335,13251,13582,13922,14270,14626,14992,15217,15445,15677,15912,16936,17328,null,null,null,70,5753,6447,7063,7711,8181,8870,9504,10138,11060,12100,12926,13249,13580,13920,14268,14625,14844,15067,15293,15522,16851,17260]
[72,5765,6676,7342,8046,8572,9332,10047,10761,11797,12674,13550,13889,14236,14592,14957,15331,15561,15794,16031,16272,17020,17328,null,null,null,71,5759,6560,7201,7876,8373,9097,9769,10442,11419,12335,13251,13582,13922,14270,14626,14992,15217,15445,15677,15912,16936,17328]
[73,5786,6793,7488,8225,8783,9584,10235,10992,12081,12884,13688,14030,14381,14740,15109,15487,15719,15955,16194,16437,17105,17328,null,null,null,72,5765,6676,7342,8046,8572,9332,10047,10761,11797,12674,13550,13889,14236,14592,14957,15331,15561,15794,16031,16272,17020,17328]
[null,null,null,null,null,null,null,null,null,null,null,null,null,null,null,null,null,null,null,null,null,null,null,null,null,null,73,5786,6793,7488,8225,8783,9584,10235,10992,12081,12884,13688,14030,14381,14740,15109,15487,15719,15955,16194,16437,17105,17328]

{"sheet":"T15J","index":5,"n_rows":36,"n_cols":48,"rows_kept":36,"cut":false,"hidden":true,"merged":[]}
[{"$f":"IFERROR(VLOOKUP(Age,T15J,MATCH(Defer+1,$B$1:$W$1,1)+1,FALSE)/100000,0)","v":7.7920000000000003E-2},1,{"$f":"B1+1","v":2},{"$f":"C1+1","v":3},4,5,6,7,8,9,10,11,12,13,14,15,16,17,18,19,20,25,30]
[40,null,null,null,null,null,null,null,null,null,null,6001,6151,6305,6463,6624,6931,7035,7141,7248,7357,7868,8500,null,null,"Issue\nAge","year 1","year 2","year 3","year 4","year 5","year 6","year 7","year 8","year 9","year 10","year 11","year 12","year 13","year 14","year 15","year 16","year 17","year 18","year 19","year 20","year 25","year 30"]
[41,null,null,null,null,null,null,null,null,null,5727,6050,6201,6356,6515,6817,6987,7092,7198,7306,7534,8055,8682,null,null,40,null,null,null,null,null,null,null,null,null,null,6001,6151,6305,6463,6624,6931,7035,7141,7248,7357,7868,8500]
[42,null,null,null,null,null,null,null,null,5468,5774,6103,6255,6412,6709,6877,7048,7154,7261,7487,7600,8153,8830,null,null,41,null,null,null,null,null,null,null,null,null,5727,6050,6201,6356,6515,6817,6987,7092,7198,7306,7534,8055,8682]
[43,null,null,null,null,null,null,null,5225,5515,5827,6161,6315,6608,6773,6942,7116,7222,7447,7559,7672,8259,8990,null,null,42,null,null,null,null,null,null,null,null,5468,5774,6103,6255,6412,6709,6877,7048,7154,7261,7487,7600,8153,8830]
[44,null,null,null,null,null,null,4995,5271,5567,5884,6224,6513,6676,6843,7014,7189,7413,7524,7637,7751,8374,9163,null,null,43,null,null,null,null,null,null,null,5225,5515,5827,6161,6315,6608,6773,6942,7116,7222,7447,7559,7672,8259,8990]
[45,null,null,null,null,null,4894,5108,5322,5623,5947,6425,6586,6751,6919,7092,7385,7496,7608,7722,7838,8500,9348,null,null,44,null,null,null,null,null,null,4995,5271,5567,5884,6224,6513,6676,6843,7014,7189,7413,7524,7637,7751,8374,9163]
[46,null,null,null,null,4683,4940,5158,5377,5684,6140,6503,6666,6832,7003,7292,7474,7586,7700,7816,8032,8682,9593,null,null,45,null,null,null,null,null,4894,5108,5322,5623,5947,6425,6586,6751,6919,7092,7385,7496,7608,7722,7838,8500,9348]
[47,null,null,null,4528,4728,4989,5213,5437,5871,6216,6588,6752,6921,7207,7387,7572,7685,7800,8016,8137,8830,9808,null,null,46,null,null,null,null,4683,4940,5158,5377,5684,6140,6503,6666,6832,7003,7292,7474,7586,7700,7816,8032,8682,9593]
[48,null,null,4293,4572,4776,5043,5272,5617,5945,6298,6680,6847,7129,7308,7490,7678,7793,8008,8129,8251,8990,10039,null,null,47,null,null,null,4528,4728,4989,5213,5437,5871,6216,6588,6752,6921,7207,7387,7572,7685,7800,8016,8137,8830,9808]
[49,null,4051,4335,4619,4828,5101,5448,5688,6025,6388,6780,7060,7236,7417,7603,7793,8008,8129,8251,8374,9163,10285,null,null,48,null,null,4293,4572,4776,5043,5272,5617,5945,6298,6680,6847,7129,7308,7490,7678,7793,8008,8129,8251,8990,10039]
[50,3537,4091,4379,4669,4884,5270,5518,5766,6112,6485,6998,7173,7352,7536,7724,8017,8137,8259,8383,8508,9348,10547,null,null,49,null,4051,4335,4619,4828,5101,5448,5688,6025,6388,6780,7060,7236,7417,7603,7793,8008,8129,8251,8374,9163,10285]
[51,3628,4133,4427,4723,5046,5339,5594,5850,6206,6695,7118,7296,7478,7665,7955,8154,8276,8400,8526,8700,9593,10918,null,null,50,3537,4091,4379,4669,4884,5270,5518,5766,6112,6485,6998,7173,7352,7536,7724,8017,8137,8259,8383,8508,9348,10547]
[52,3719,4178,4478,4881,5112,5412,5676,5939,6406,6810,7247,7428,7614,7901,8099,8302,8426,8552,8727,8858,9808,11220,null,null,51,3628,4133,4427,4723,5046,5339,5594,5850,6206,6695,7118,7296,7478,7665,7955,8154,8276,8400,8526,8700,9593,10918]
[53,3811,4225,4627,4944,5182,5491,5763,6132,6516,6933,7386,7570,7857,8053,8254,8461,8588,8763,8894,9028,10039,11542,null,null,52,3719,4178,4478,4881,5112,5412,5676,5939,6406,6810,7247,7428,7614,7901,8099,8302,8426,8552,8727,8858,9808,11220]
[54,3902,4365,4686,5011,5257,5575,5950,6237,6635,7066,7535,7820,8016,8216,8422,8632,8808,8940,9074,9210,10285,11883,null,null,53,3811,4225,4627,4944,5182,5491,5763,6132,6516,6933,7386,7570,7857,8053,8254,8461,8588,8763,8894,9028,10039,11542]
[55,4077,4420,4749,5082,5336,5754,6051,6349,6761,7209,7792,7987,8187,8391,8601,8863,8996,9131,9268,9407,10547,12247,null,null,54,3902,4365,4686,5011,5257,5575,5950,6237,6635,7066,7535,7820,8016,8216,8422,8632,8808,8940,9074,9210,10285,11883]
[56,4170,4522,4863,5209,5506,5850,6159,6468,6896,7453,7967,8166,8370,8579,8840,9061,9197,9335,9475,9663,10918,12682,null,null,55,4077,4420,4749,5082,5336,5754,6051,6349,6761,7209,7792,7987,8187,8391,8601,8863,8996,9131,9268,9407,10547,12247]
[57,4263,4584,4934,5373,5597,5952,6274,6596,7128,7618,8154,8358,8567,8827,9048,9274,9413,9554,9744,9890,11220,13096,null,null,56,4170,4522,4863,5209,5506,5850,6159,6468,6896,7453,7967,8166,8370,8579,8840,9061,9197,9335,9475,9663,10918,12682]
[58,4352,4648,5087,5460,5692,6060,6396,6815,7283,7794,8354,8562,8823,9043,9270,9501,9644,9835,9983,10133,11542,13536,null,null,57,4263,4584,4934,5373,5597,5952,6274,6596,7128,7618,8154,8358,8567,8827,9048,9274,9413,9554,9744,9890,11220,13096]
[59,4441,4790,5166,5550,5793,6175,6606,6961,7448,7981,8567,8827,9048,9274,9506,9744,9937,10086,10238,10391,11883,13833,null,null,58,4352,4648,5087,5460,5692,6060,6396,6815,7283,7794,8354,8562,8823,9043,9270,9501,9644,9835,9983,10133,11542,13536]
[60,4601,4862,5249,5645,5899,6374,6745,7115,7624,8182,8841,9062,9289,9521,9759,10051,10202,10355,10510,10668,12247,14130,null,null,59,4441,4790,5166,5550,5793,6175,6606,6961,7448,7981,8567,8827,9048,9274,9506,9744,9937,10086,10238,10391,11883,13833]
[61,4692,4936,5335,5745,6086,6503,6890,7278,7810,8439,9086,9313,9546,9785,10077,10329,10484,10641,10801,11054,12682,14543,null,null,60,4601,4862,5249,5645,5899,6374,6745,7115,7624,8182,8841,9062,9289,9521,9759,10051,10202,10355,10510,10668,12247,14130]
[62,4782,5014,5426,5923,6204,6638,7045,7451,8049,8665,9346,9580,9819,10113,10366,10625,10784,10946,11203,11371,13096,14908,null,null,61,4692,4936,5335,5745,6086,6503,6890,7278,7810,8439,9086,9313,9546,9785,10077,10329,10484,10641,10801,11054,12682,14543]
[63,4845,5094,5589,6033,6328,6781,7207,7674,8260,8906,9623,9864,10159,10412,10673,10940,11104,11364,11535,11708,13536,15245,null,null,62,4782,5014,5426,5923,6204,6638,7045,7451,8049,8665,9346,9580,9819,10113,10366,10625,10784,10946,11203,11371,13096,14908]
[64,4908,5242,5687,6148,6458,6929,7416,7867,8482,9163,9918,10214,10470,10731,11000,11275,11539,11712,11888,12066,13833,15400,null,null,63,4845,5094,5589,6033,6328,6781,7207,7674,8260,8906,9623,9864,10159,10412,10673,10940,11104,11364,11535,11708,13536,15245]
[65,5034,5329,5790,6268,6594,7123,7597,8070,8717,9434,10281,10538,10802,11072,11349,11729,11905,12084,12265,12449,14130,15555,null,null,64,4908,5242,5687,6148,6458,6929,7416,7867,8482,9163,9918,10214,10470,10731,11000,11275,11539,11712,11888,12066,13833,15400]
[66,5097,5418,5896,6392,6771,7288,7787,8285,8965,9768,10618,10883,11155,11434,11817,12113,12295,12479,12666,12903,14543,15633,null,null,65,5034,5329,5790,6268,6594,7123,7597,8070,8717,9434,10281,10538,10802,11072,11349,11729,11905,12084,12265,12449,14130,15555]
[67,5161,5511,6006,6556,6919,7460,7986,8512,9272,10074,10974,11248,11530,11916,12214,12520,12707,12898,13139,13336,14908,15711,null,null,66,5097,5418,5896,6392,6771,7288,7787,8285,8965,9768,10618,10883,11155,11434,11817,12113,12295,12479,12666,12903,14543,15633]
[68,5167,5607,6153,6694,7077,7644,8178,8753,9510,10357,11215,11495,11881,12178,12482,12794,12986,13229,13427,13629,15245,15790,null,null,67,5161,5511,6006,6556,6919,7460,7986,8512,9272,10074,10974,11248,11530,11916,12214,12520,12707,12898,13139,13336,14908,15711]
[69,5172,5733,6269,6831,7234,7828,8409,8953,9748,10639,11456,11840,12136,12439,12750,13069,13313,13513,13716,13921,15400,15869,null,null,68,5167,5607,6153,6694,7077,7644,8178,8753,9510,10357,11215,11495,11881,12178,12482,12794,12986,13229,13427,13629,15245,15790]
[70,5205,5833,6390,6976,7402,8064,8640,9216,10055,11000,11849,12145,12449,12760,13079,13455,13656,13861,14069,14280,15555,15932,null,null,69,5172,5733,6269,6831,7234,7828,8409,8953,9748,10639,11456,11840,12136,12439,12750,13069,13313,13513,13716,13921,15400,15869]
[71,5211,5936,6515,7126,7612,8270,8881,9493,10381,11307,12146,12450,12761,13080,13456,13793,13999,14209,14423,14688,15633,15995,null,null,70,5205,5833,6390,6976,7402,8064,8640,9216,10055,11000,11849,12145,12449,12760,13079,13455,13656,13861,14069,14280,15555,15932]
[72,5216,6040,6643,7315,7793,8484,9133,9783,10814,11618,12421,12732,13050,13425,13760,14104,14316,14531,14798,15020,15711,15995,null,null,71,5211,5936,6515,7126,7612,8270,8881,9493,10381,11307,12146,12450,12761,13080,13456,13793,13999,14209,14423,14688,15633,15995]
[73,5235,6146,6807,7477,7984,8712,9305,10076,11074,11811,12547,12861,13230,13561,13900,14248,14461,14727,14948,15173,15790,15995,null,null,72,5216,6040,6643,7315,7793,8484,9133,9783,10814,11618,12421,12732,13050,13425,13760,14104,14316,14531,14798,15020,15711,15995]
[null,null,null,null,null,null,null,null,null,null,null,null,null,null,null,null,null,null,null,null,null,null,null,null,null,73,5235,6146,6807,7477,7984,8712,9305,10076,11074,11811,12547,12861,13230,13561,13900,14248,14461,14727,14948,15173,15790,15995]

{"sheet":"Phoenix","index":6,"n_rows":44,"n_cols":27,"rows_kept":44,"cut":false,"hidden":true,"merged":[]}
["Single",50,{"$f":"B1+1","v":51},{"$f":"C1+1","v":52},53,54,55,56,57,58,59,60,61,62,63,64,65,66,67,68,69,70,71,72,73,74,75]
[0,3830,3910,3980,4040,4100,4150,4210,4270,4310,4380,4450,4510,4580,4650,4770,4900,5010,5060,5100,5190,5280,5360,5420,5480,5550,5680]
[{"$f":"A2+1","v":1},4166,4211,4278,4334,4390,4446,4514,4558,4637,4704,4771,4850,4917,5040,5174,5320,5354,5387,5488,5589,5690,5768,5858,6003,6160,6306]
[2,4566,4629,4704,4754,4817,4892,4942,5018,5105,5168,5256,5331,5469,5620,5758,5795,5846,5946,6059,6159,6259,6347,6510,6673,6836,7000]
[3,4889,4959,5016,5086,5156,5212,5297,5381,5451,5535,5620,5760,5915,6069,6111,6154,6280,6406,6561,6702,6828,6968,7109,7235,7502,7783]
[4,5743,5853,5964,6074,6200,6310,6546,6609,6719,6861,6939,7097,7207,7348,7490,7632,7931,7993,8119,8292,8466,8717,8922,9126,9331,9488]
[5,6133,6256,6380,6503,6626,7190,7190,7190,7226,7384,7684,7684,7825,7983,8142,8442,8494,8688,8865,9058,9288,9517,9746,9992,10239,10504]
[6,6514,6652,6770,6908,7204,7264,7422,7579,7737,7895,8053,8231,8428,8606,8803,9001,9218,9435,9652,9869,10106,10402,10698,10994,11310,11646]
[7,6897,7052,7207,7362,7516,7671,7914,8091,8246,8423,8600,8821,9042,9263,9484,9727,9992,10235,10523,10788,11076,11407,11761,12137,12446,12888]
[8,7354,7552,7750,7948,8146,8369,8542,8790,8913,9112,9310,9557,9830,10151,10374,10647,10969,11315,11662,12008,12256,12306,13197,13494,13568,14039]
[9,7848,8070,8236,8236,8430,8624,9179,9207,9207,9872,10039,10039,10704,11037,11342,11675,12063,12479,12923,13033,13117,14115,14115,14448,14864,15280]
[10,8386,8572,8914,9038,9255,9318,9535,10156,10405,10684,10746,10902,11678,12051,12423,12827,13293,13790,13914,13914,15063,15063,15343,15871,16181,16523]
[11,8572,8914,9038,9255,9318,9535,10156,10405,10684,10746,10902,11678,12051,12423,12827,13293,13790,13914,13914,15063,15063,15343,15871,16181,16523,19971]
[12,8914,9038,9255,9318,9535,10156,10405,10684,10746,10902,11678,12051,12423,12827,13293,13790,13914,13914,15063,15063,15343,15871,16181,16523,19971,20778]
[13,9038,9255,9318,9535,10156,10405,10684,10746,10902,11678,12051,12423,12827,13293,13790,13914,13914,15063,15063,15343,15871,16181,16523,19971,20778,21586]
[14,9255,9318,9535,10156,10405,10684,10746,10902,11678,12051,12423,12827,13293,13790,13914,13914,15063,15063,15343,15871,16181,16523,19971,20778,21586,21741]
[15,9318,9535,10156,10405,10684,10746,10902,11678,12051,12423,12827,13293,13790,13914,13914,15063,15063,15343,15871,16181,16523,19971,20778,21586,21741,23294]
[16,9535,10156,10405,10684,10746,10902,11678,12051,12423,12827,13293,13790,13914,13914,15063,15063,15343,15871,16181,16523,19971,20778,21586,21741,23294,23294]
[17,10156,10405,10684,10746,10902,11678,12051,12423,12827,13293,13790,13914,13914,15063,15063,15343,15871,16181,16523,19971,20778,21586,21741,23294,23294,23294]
[18,10405,10684,10746,10902,11678,12051,12423,12827,13293,13790,13914,13914,15063,15063,15343,15871,16181,16523,19971,20778,21586,21741,23294,23294,23294,23294]
[19,10684,10746,10902,11678,12051,12423,12827,13293,13790,13914,13914,15063,15063,15343,15871,16181,16523,19971,20778,21586,21741,23294,23294,23294,23294,23294]
[]
[]
["Joint",50,{"$f":"B24+1","v":51},52,53,54,55,56,57,58,59,60,61,62,63,64,65,66,67,68,69,70,71,72,73,74,75]
[0,3330,3410,3480,3540,3600,3650,3710,3770,3810,3880,3950,4010,4080,4150,4270,4400,4510,4560,4600,4690,4780,4860,4920,4980,5050,5180]
[{"$f":"A25+1","v":1},3606,3651,3718,3774,3830,3886,3954,3998,4077,4144,4211,4290,4357,4480,4614,4760,4794,4827,4928,5029,5130,5208,5298,5443,5600,5746]
[2,3939,4002,4077,4127,4190,4265,4315,4390,4478,4541,4629,4704,4842,4993,5130,5168,5218,5319,5432,5532,5632,5720,5883,6046,6209,6372]
[3,4187,4257,4313,4383,4454,4510,4594,4678,4749,4833,4917,5058,5212,5367,5409,5451,5578,5704,5859,5999,6125,6266,6406,6533,6800,7081]
[4,4957,5067,5177,5287,5413,5523,5759,5822,5932,6074,6152,6310,6420,6562,6703,6845,7144,7207,7333,7506,7679,7931,8135,8340,8544,8702]
[5,5252,5375,5499,5622,5745,6309,6309,6309,6344,6503,6803,6803,6944,7102,7261,7560,7613,7807,7983,8177,8406,8635,8865,9111,9358,9622]
[6,5527,5665,5783,5921,6218,6277,6435,6593,6750,6908,7066,7244,7441,7619,7816,8014,8231,8448,8665,8882,9119,9415,9711,10007,10323,10659]
[7,5792,5947,6101,6256,6411,6566,6809,6986,7141,7317,7494,7715,7936,8157,8378,8622,8887,9130,9418,9683,9970,10302,10655,11031,11341,11783]
[8,6116,6314,6512,6710,6908,7131,7304,7552,7675,7874,8072,8319,8592,8913,9136,9409,9731,10077,10424,10770,11018,11068,11959,12256,12330,12801]
[9,6461,6683,6850,6850,7044,7238,7792,7820,7820,8486,8652,8652,9318,9650,9955,10288,10676,11092,11536,11647,11730,12728,12728,13061,13477,13893]
[10,6833,7019,7361,7485,7703,7765,7982,8603,8852,9131,9193,9349,10125,10498,10870,11274,11740,12237,12361,12361,13510,13510,13790,14318,14629,14970]
[11,7019,7361,7485,7703,7765,7982,8603,8852,9131,9193,9349,10125,10498,10870,11274,11740,12237,12361,12361,13510,13510,13790,14318,14629,14970,18418]
[12,7361,7485,7703,7765,7982,8603,8852,9131,9193,9349,10125,10498,10870,11274,11740,12237,12361,12361,13510,13510,13790,14318,14629,14970,18418,19225]
[13,7485,7703,7765,7982,8603,8852,9131,9193,9349,10125,10498,10870,11274,11740,12237,12361,12361,13510,13510,13790,14318,14629,14970,18418,19225,20033]
[14,7703,7765,7982,8603,8852,9131,9193,9349,10125,10498,10870,11274,11740,12237,12361,12361,13510,13510,13790,14318,14629,14970,18418,19225,20033,20188]
[15,7765,7982,8603,8852,9131,9193,9349,10125,10498,10870,11274,11740,12237,12361,12361,13510,13510,13790,14318,14629,14970,18418,19225,20033,20188,21741]
[16,7982,8603,8852,9131,9193,9349,10125,10498,10870,11274,11740,12237,12361,12361,13510,13510,13790,14318,14629,14970,18418,19225,20033,20188,21741,21741]
[17,8603,8852,9131,9193,9349,10125,10498,10870,11274,11740,12237,12361,12361,13510,13510,13790,14318,14629,14970,18418,19225,20033,20188,21741,21741,21741]
[18,8852,9131,9193,9349,10125,10498,10870,11274,11740,12237,12361,12361,13510,13510,13790,14318,14629,14970,18418,19225,20033,20188,21741,21741,21741,21741]
[19,9131,9193,9349,10125,10498,10870,11274,11740,12237,12361,12361,13510,13510,13790,14318,14629,14970,18418,19225,20033,20188,21741,21741,21741,21741,21741]

{"sheet":"AltiSure","index":7,"n_rows":24,"n_cols":10,"rows_kept":24,"cut":false,"hidden":true,"merged":[]}
["NG",50,75,100,null,null,"NG Bonus",50,75,100]
[50,3.85E-2,3.4000000000000002E-2,0.03,null,null,50,3.4500000000000003E-2,3.1E-2,2.75E-2]
[51,0.04,3.5000000000000003E-2,3.1E-2,null,null,51,3.5999999999999997E-2,3.15E-2,2.75E-2]
[56,4.2000000000000003E-2,3.6999999999999998E-2,3.1E-2,null,null,56,3.7499999999999999E-2,3.2500000000000001E-2,2.75E-2]
[61,4.4999999999999998E-2,3.7999999999999999E-2,3.1E-2,null,null,61,3.9E-2,3.3000000000000002E-2,2.6499999999999999E-2]
[66,4.7E-2,0.04,3.1E-2,null,null,66,4.0500000000000001E-2,3.3000000000000002E-2,2.35E-2]
[71,4.7500000000000001E-2,0.04,2.8000000000000001E-2,null,null,71,0.04,3.2000000000000001E-2,0.02]
[76,0.04,4.2500000000000003E-2,2.75E-2,null,null,76,4.1000000000000002E-2,3.2000000000000001E-2,1.7500000000000002E-2]
[81,0.06,4.5999999999999999E-2,2.7E-2,null,null,81,4.3499999999999997E-2,3.2500000000000001E-2,1.4999999999999999E-2]
[]
[null,null,null,{"$f":"INDEX(Table[Increase Type],MATCH(\"Next Generation\",Table[Rider Name],0))","v":0},null,null,null,null,null,{"$f":"INDEX(Table[Increase Type],MATCH(\"Next Generation Bonus\",Table[Rider Name],0))","v":75}]
[null,null,"Used",{"$f":"VLOOKUP(Age,A2:D9,MATCH(D11,A1:D1,0),TRUE)","v":{"$error":"#N/A"}},null,null,null,null,"Used",{"$f":"VLOOKUP(Age,G2:J9,MATCH(J11,G1:J1,0),TRUE)","v":3.15E-2}]
[]
[]
[]
[null,50,75,100,null,null,null,50,75,100]
[50,4.9000000000000002E-2,4.2000000000000003E-2,3.7999999999999999E-2,null,null,50,4.3499999999999997E-2,3.7999999999999999E-2,3.4500000000000003E-2]
[51,0.05,4.2000000000000003E-2,3.7999999999999999E-2,null,null,51,4.4999999999999998E-2,3.7999999999999999E-2,3.4500000000000003E-2]
[56,5.5E-2,4.8500000000000001E-2,3.95E-2,null,null,56,4.9000000000000002E-2,4.2500000000000003E-2,3.5499999999999997E-2]
[61,0.06,5.1999999999999998E-2,4.2500000000000003E-2,null,null,61,5.2499999999999998E-2,4.4999999999999998E-2,3.6499999999999998E-2]
[66,6.5000000000000002E-2,5.5E-2,4.2500000000000003E-2,null,null,66,5.6000000000000001E-2,4.7500000000000001E-2,3.5000000000000003E-2]
[71,7.0000000000000007E-2,5.7500000000000002E-2,4.2500000000000003E-2,null,null,71,5.8000000000000003E-2,4.5999999999999999E-2,3.2500000000000001E-2]
[76,0.08,6.4000000000000001E-2,4.4999999999999998E-2,null,null,76,6.5000000000000002E-2,0.05,0.03]
[81,null,null,null,null,null,81]

{"sheet":"TVA","index":8,"n_rows":23,"n_cols":16,"rows_kept":23,"cut":false,"hidden":true,"merged":[]}
[null,"Fixed","Fixed Guar","Guar","Recent 33/33/33","Worst 33/33/33","Median 33/33/33","Best 33/33/33","ALTVI Recent 75/25","ALTVI Worst 75/25","ALTVI Median 75/25","ALTVI Best 75/25","TVBI Recent 75/25","TVBI Worst 75/25","TVBI Median 75/25","TVBI Best 75/25"]
[null,5.5E-2,0.05,0.04,{"$f":"E13^0.1-1","v":8.5586574132673565E-2},8.0175126420142684E-2,9.9693018258169452E-2,0.10636276931766275,6.8273835517024484E-2,6.7035242425252051E-2,0.10608547309429417,0.11707670782606749,0.10534240769601211,9.679427231163773E-2,0.10123010689662926,0.10495229397559713]
[0,{"$f":"(1+B$2)^$A3","v":1},1,1,1,1,1,1,1,1,1,1,1,1,1,1]
[1,1.0549999999999999,1.05,1.04,1.0649066464238806,1.0537576361309189,1.0652485064607784,1.0662747849985987,1.0572055865879553,1.0572055865879553,1.0728948157947846,1.0602841681643524,1.0719624716327927,1.046875,1.0570424949203734,1.0719624716327927]
[{"$f":"A4+1","v":2},1.1130249999999999,1.1025,1.0816000000000001,1.1652125380386145,1.1123582625184922,1.1449703722703741,1.1801585813576718,1.1436285299299642,1.1365103198890398,1.1467604157062432,1.1772631175136159,1.1932326635910127,1.0887500000000001,1.1445477921261022,1.1932326635910127]
[3,1.1742413749999998,1.1576250000000001,1.1248640000000001,1.2912108457159932,1.2147734781428627,1.2545605846788912,1.3536783514031927,1.2437666314384872,1.2290195651847522,1.2583391110313067,1.3843567048257617,1.3574099189171427,1.2155848758943921,1.2603519481527947,1.3574099189171427]
[4,1.2388246506249998,1.21550625,1.1698585600000002,1.4719768148899799,1.3582038895415633,1.418709875607931,1.5338057066583877,1.3845665226490218,1.3616962529851746,1.3984035481796704,1.5237328021596404,1.6029242294049058,1.3941007000620982,1.4691924176541276,1.6029242294049058]
[5,1.3069600064093747,1.2762815625000001,1.2166529024000003,1.6852803222987813,1.5422179855769553,1.6960829416347805,1.7559378378362658,1.5708101081172015,1.5464693460911896,1.73818875794935,1.7298481124477236,1.874807174182878,1.6031172186673439,1.7317433761774705,1.874807174182878]
[6,1.3788428067618903,1.340095640625,1.2653190184960004,1.761557540657297,1.6327747976389166,1.7714391563000764,1.8289563399609303,1.6536369191647038,1.6355467361550651,1.807716308267324,1.805302708685558,1.9497994611501932,1.6961874512995503,1.8179085395651493,1.9497994611501932]
[7,1.4546791611337941,1.4071004226562502,1.3159317792358403,1.8588957968198254,1.7579408172030677,1.8978900122420401,1.964290483883504,1.7629873252431227,1.7436758657509002,1.9512101516158571,2.0174887246474236,2.035290879141352,1.8465675916104225,1.9346199183035031,2.0277914395962009]
[8,1.5346865149961528,1.4774554437890626,1.3685690504052741,2.0111084079906609,1.8621654817239091,2.0870538108472969,2.1196081177029606,1.8958796710617634,1.875274020398777,2.1478085531205227,2.1759342381706257,2.2188580093995274,1.9248957926308572,2.1376517303514828,2.2037141487042233]
[9,1.6190942733209412,1.5513282159785158,1.4233118124214852,2.075443607423388,1.9728233185343185,2.2990101856889154,2.3814576064773596,1.874336403043078,1.8599822746243209,2.427843719944526,2.5834029801265141,2.3683262091698483,2.1627548699290604,2.3179732457203746,2.3593080329536695]
[10,1.708144458353593,1.6288946267774416,1.4802442849183446,2.2732365803040722,2.1624283381195752,2.586513074763249,2.747739311663512,1.9356459202584533,1.9133201133896449,2.7408602032670886,3.0257285578467181,2.722502738976821,2.519136718255127,2.6228941353538771,2.7129093275559502]
[11,1.8020924035630403,1.7103393581163138,1.5394540563150783,2.424221456084386,2.2702111547494717,2.7554808446326895,2.9290701806210038,2.0438250633737227,2.019980485693007,2.9458151732972668,3.2040177596091612,2.9229877897300698,2.6259785933187669,2.7673233812845099,2.9127501607640225]
[12,1.9012074857590076,1.7958563260221292,1.6010322185676817,2.6822703963954186,2.3995388408632614,2.9705379928094717,3.2850636845651109,2.2187632403515885,2.1878981216918962,3.153702249821805,3.6014055192778698,3.2949617389615145,2.7310177370515176,3.0104525013348029,3.2840649761444296]
[13,2.0057738974757529,1.885649142323236,1.6650735073103891,3.0285855999543054,2.6690486368427906,3.2901552640839062,3.8782572151865931,2.4280404269225322,2.3912735045145506,3.4928610508804585,4.3465817618854929,3.8186244433016259,3.1120746046642487,3.3507295598305467,3.804084162531165]
[14,2.1160914618369193,1.9799315994393973,1.7316764476028046,3.5632772457047137,3.0696012305394778,3.8087254950606737,4.5011442496696548,2.7408415629281517,2.6972350219686914,3.9170090373187638,4.8061017214844552,4.6045037479656337,3.6523856132573957,3.9885036337068565,4.5869710530651187]
[15,2.2324764922379496,2.0789281794113679,1.8009435055069167,4.174267011724031,3.5515645125754904,4.7242321371272196,5.2626387956321672,3.1546781915192783,3.1070588862252513,5.0453043700455655,5.5314073913402995,5.487516490472192,4.269668252910777,4.8083679718121264,5.4666215237927727]
[16,2.3552626993110368,2.182874588381936,1.8729812457271937,4.3634916719765142,3.7502861906446601,4.9396893111327715,5.4844953931211347,3.329399471932855,3.2791427800376383,5.2471165448473887,5.7763275895700765,5.7070171500910796,4.5088340641985774,5.0561420342450587,5.6852863847444839]
[17,2.4848021477731437,2.2920183178010332,1.9479004955562815,4.5767462125465377,4.0536399186895,5.2966485762001865,5.9546965576512365,3.5468391615631747,3.4933002562899409,5.6720520182378369,6.5291343062626428,5.9352978360947235,4.9219351952090173,5.3754418812121294,5.912697840134264]
[18,2.6214662659006667,2.4066192336910848,2.025816515378533,4.974149712960628,4.2680041896384617,5.8641754565752446,6.4759933873314832,3.8157917850565961,3.7581930878457275,6.2661800610709255,7.0683282253697577,6.4866677992096609,5.1062709280422416,5.9651298526835035,6.4619683367551453]
[19,2.7656469105252031,2.526950195375639,2.1068491759936743,5.1633940512535821,4.5597669279759847,6.540070937957946,7.3709899442566433,3.7376505618945846,3.681231392526461,7.1459298524893473,8.4742964481676264,6.9395128218865283,5.7696160836785726,6.4936259085892241,6.9130890490493115]
[20,2.9177574906040893,2.6532977051444209,2.1911231430334213,5.7576886458448433,5.1214671934674225,7.4405619926468063,8.6373463196971461,3.8381483778499135,3.7802122118536636,8.1185259698939394,10.017449208027404,8.0421442155635106,6.813842523783566,7.3991447994229036,8.0115219230005543]

{"sheet":"PIATodaySingle","index":9,"n_rows":85,"n_cols":100,"rows_kept":85,"cut":false,"hidden":true,"merged":[]}
[1,{"$f":"A1+1","v":2},{"$f":"B1+1","v":3},4,5,6,7,8,9,10,11,12,13,14,15,16,17,18,19,20,21,22,23,24,25,26,27,28,29,30,31,32,33,34,35,36,37,38,39,40,41,42,43,44,45,46,47,48,49,50,{"$f":"AX1+1","v":51},52,53,54,55,56,57,58,59,60,61,62,63,64,65,66,67,68,{"$f":"BP1+1","v":69},70,71,72,73,74,75,76,77,78,79,80,81,82,83,84,85,86,87,88,89,{"$f":"CK1+1","v":90},91,92,93,94,95,96,97,98,99,100]
[{"$f":"A1+1","v":2},0,0,0,0,0,0,0,0,0,0,0,0,0,0,0,0,0,0,0,0,0,0,0,0,0,0,0,0,0,0,0,0,0,0,0,0,0,0,0,0,0,0,0,0,0,0,0,0,3.39,3.44,3.48,3.53,3.59,3.63,3.68,3.73,3.77,3.98,4.37,4.37,4.37,4.37,4.37,4.7,4.7,4.7,4.7,4.78,5.13,5.13,5.26,5.31,5.31,5.55,5.55,5.55,5.67,5.72,6.1,6.1,6.18,6.18,6.23,6.48,6.63,6.63,6.63,6.63,6.63,6.63,6.63,6.63,6.63,6.63,6.63,6.63,6.63,6.63,6.63]
[{"$f":"A2+1","v":3},0,0,0,0,0,0,0,0,0,0,0,0,0,0,0,0,0,0,0,0,0,0,0,0,0,0,0,0,0,0,0,0,0,0,0,0,0,0,0,0,0,0,0,0,0,0,0,0,3.39,3.44,3.48,3.53,3.59,3.63,3.68,3.73,3.77,3.98,4.37,4.37,4.37,4.37,4.37,4.7,4.7,4.7,4.7,4.78,5.13,5.13,5.26,5.31,5.31,5.55,5.55,5.55,5.67,5.72,6.1,6.1,6.18,6.18,6.23,6.48,6.63,6.63,6.63,6.63,6.63,6.63,6.63,6.63,6.63,6.63,6.63,6.63,6.63,6.63,6.63]
[4,0,0,0,0,0,0,0,0,0,0,0,0,0,0,0,0,0,0,0,0,0,0,0,0,0,0,0,0,0,0,0,0,0,0,0,0,0,0,0,0,0,0,0,0,0,0,0,0,3.39,3.44,3.48,3.53,3.59,3.63,3.68,3.73,3.77,3.98,4.37,4.37,4.37,4.37,4.37,4.7,4.7,4.7,4.7,4.78,5.13,5.13,5.26,5.31,5.31,5.55,5.55,5.55,5.67,5.72,6.1,6.1,6.18,6.18,6.23,6.48,6.63,6.63,6.63,6.63,6.63,6.63,6.63,6.63,6.63,6.63,6.63,6.63,6.63,6.63,6.63]
[5,0,0,0,0,0,0,0,0,0,0,0,0,0,0,0,0,0,0,0,0,0,0,0,0,0,0,0,0,0,0,0,0,0,0,0,0,0,0,0,0,0,0,0,0,0,0,0,0,3.39,3.44,3.48,3.53,3.59,3.63,3.68,3.73,3.77,3.98,4.37,4.37,4.37,4.37,4.37,4.7,4.7,4.7,4.7,4.78,5.13,5.13,5.26,5.31,5.31,5.55,5.55,5.55,5.67,5.72,6.1,6.1,6.18,6.18,6.23,6.48,6.63,6.63,6.63,6.63,6.63,6.63,6.63,6.63,6.63,6.63,6.63,6.63,6.63,6.63,6.63]
[6,0,0,0,0,0,0,0,0,0,0,0,0,0,0,0,0,0,0,0,0,0,0,0,0,0,0,0,0,0,0,0,0,0,0,0,0,0,0,0,0,0,0,0,0,0,0,0,0,3.39,3.44,3.48,3.53,3.59,3.63,3.68,3.73,3.77,3.98,4.37,4.37,4.37,4.37,4.37,4.7,4.7,4.7,4.7,4.78,5.13,5.13,5.26,5.31,5.31,5.55,5.55,5.55,5.67,5.72,6.1,6.1,6.18,6.18,6.23,6.48,6.63,6.63,6.63,6.63,6.63,6.63,6.63,6.63,6.63,6.63,6.63,6.63,6.63,6.63,6.63]
[7,0,0,0,0,0,0,0,0,0,0,0,0,0,0,0,0,0,0,0,0,0,0,0,0,0,0,0,0,0,0,0,0,0,0,0,0,0,0,0,0,0,0,0,0,0,0,0,0,3.39,3.44,3.48,3.53,3.59,3.63,3.68,3.73,3.77,3.98,4.37,4.37,4.37,4.37,4.37,4.7,4.7,4.7,4.7,4.78,5.13,5.13,5.26,5.31,5.31,5.55,5.55,5.55,5.67,5.72,6.1,6.1,6.18,6.18,6.23,6.48,6.63,6.63,6.63,6.63,6.63,6.63,6.63,6.63,6.63,6.63,6.63,6.63,6.63,6.63,6.63]
[8,0,0,0,0,0,0,0,0,0,0,0,0,0,0,0,0,0,0,0,0,0,0,0,0,0,0,0,0,0,0,0,0,0,0,0,0,0,0,0,0,0,0,0,0,0,0,0,0,3.39,3.44,3.48,3.53,3.59,3.63,3.68,3.73,3.77,3.98,4.37,4.37,4.37,4.37,4.37,4.7,4.7,4.7,4.7,4.78,5.13,5.13,5.26,5.31,5.31,5.55,5.55,5.55,5.67,5.72,6.1,6.1,6.18,6.18,6.23,6.48,6.63,6.63,6.63,6.63,6.63,6.63,6.63,6.63,6.63,6.63,6.63,6.63,6.63,6.63,6.63]
[9,0,0,0,0,0,0,0,0,0,0,0,0,0,0,0,0,0,0,0,0,0,0,0,0,0,0,0,0,0,0,0,0,0,0,0,0,0,0,0,0,0,0,0,0,0,0,0,0,3.39,3.44,3.48,3.53,3.59,3.63,3.68,3.73,3.77,3.98,4.37,4.37,4.37,4.37,4.37,4.7,4.7,4.7,4.7,4.78,5.13,5.13,5.26,5.31,5.31,5.55,5.55,5.55,5.67,5.72,6.1,6.1,6.18,6.18,6.23,6.48,6.63,6.63,6.63,6.63,6.63,6.63,6.63,6.63,6.63,6.63,6.63,6.63,6.63,6.63,6.63]
[10,0,0,0,0,0,0,0,0,0,0,0,0,0,0,0,0,0,0,0,0,0,0,0,0,0,0,0,0,0,0,0,0,0,0,0,0,0,0,0,0,0,0,0,0,0,0,0,0,3.39,3.44,3.48,3.53,3.59,3.63,3.68,3.73,3.77,3.98,4.37,4.37,4.37,4.37,4.37,4.7,4.7,4.7,4.7,4.78,5.13,5.13,5.26,5.31,5.31,5.55,5.55,5.55,5.67,5.72,6.1,6.1,6.18,6.18,6.23,6.48,6.63,6.63,6.63,6.63,6.63,6.63,6.63,6.63,6.63,6.63,6.63,6.63,6.63,6.63,6.63]
[11,0,0,0,0,0,0,0,0,0,0,0,0,0,0,0,0,0,0,0,0,0,0,0,0,0,0,0,0,0,0,0,0,0,0,0,0,0,0,0,0,0,0,0,0,0,0,0,0,3.39,3.44,3.48,3.53,3.59,3.63,3.68,3.73,3.77,3.98,4.37,4.37,4.37,4.37,4.37,4.7,4.7,4.7,4.7,4.78,5.13,5.13,5.26,5.31,5.31,5.55,5.55,5.55,5.67,5.72,6.1,6.1,6.18,6.18,6.23,6.48,6.63,6.63,6.63,6.63,6.63,6.63,6.63,6.63,6.63,6.63,6.63,6.63,6.63,6.63,6.63]
[12,0,0,0,0,0,0,0,0,0,0,0,0,0,0,0,0,0,0,0,0,0,0,0,0,0,0,0,0,0,0,0,0,0,0,0,0,0,0,0,0,0,0,0,0,0,0,0,0,3.39,3.44,3.48,3.53,3.59,3.63,3.68,3.73,3.77,3.98,4.37,4.37,4.37,4.37,4.37,4.7,4.7,4.7,4.7,4.78,5.13,5.13,5.26,5.31,5.31,5.55,5.55,5.55,5.67,5.72,6.1,6.1,6.18,6.18,6.23,6.48,6.63,6.63,6.63,6.63,6.63,6.63,6.63,6.63,6.63,6.63,6.63,6.63,6.63,6.63,6.63]
[13,0,0,0,0,0,0,0,0,0,0,0,0,0,0,0,0,0,0,0,0,0,0,0,0,0,0,0,0,0,0,0,0,0,0,0,0,0,0,0,0,0,0,0,0,0,0,0,0,3.39,3.44,3.48,3.53,3.59,3.63,3.68,3.73,3.77,3.98,4.37,4.37,4.37,4.37,4.37,4.7,4.7,4.7,4.7,4.78,5.13,5.13,5.26,5.31,5.31,5.55,5.55,5.55,5.67,5.72,6.1,6.1,6.18,6.18,6.23,6.48,6.63,6.63,6.63,6.63,6.63,6.63,6.63,6.63,6.63,6.63,6.63,6.63,6.63,6.63,6.63]
[14,0,0,0,0,0,0,0,0,0,0,0,0,0,0,0,0,0,0,0,0,0,0,0,0,0,0,0,0,0,0,0,0,0,0,0,0,0,0,0,0,0,0,0,0,0,0,0,0,3.39,3.44,3.48,3.53,3.59,3.63,3.68,3.73,3.77,3.98,4.37,4.37,4.37,4.37,4.37,4.7,4.7,4.7,4.7,4.78,5.13,5.13,5.26,5.31,5.31,5.55,5.55,5.55,5.67,5.72,6.1,6.1,6.18,6.18,6.23,6.48,6.63,6.63,6.63,6.63,6.63,6.63,6.63,6.63,6.63,6.63,6.63,6.63,6.63,6.63,6.63]
[15,0,0,0,0,0,0,0,0,0,0,0,0,0,0,0,0,0,0,0,0,0,0,0,0,0,0,0,0,0,0,0,0,0,0,0,0,0,0,0,0,0,0,0,0,0,0,0,0,3.39,3.44,3.48,3.53,3.59,3.63,3.68,3.73,3.77,3.98,4.37,4.37,4.37,4.37,4.37,4.7,4.7,4.7,4.7,4.78,5.13,5.13,5.26,5.31,5.31,5.55,5.55,5.55,5.67,5.72,6.1,6.1,6.18,6.18,6.23,6.48,6.63,6.63,6.63,6.63,6.63,6.63,6.63,6.63,6.63,6.63,6.63,6.63,6.63,6.63,6.63]
[16,0,0,0,0,0,0,0,0,0,0,0,0,0,0,0,0,0,0,0,0,0,0,0,0,0,0,0,0,0,0,0,0,0,0,0,0,0,0,0,0,0,0,0,0,0,0,0,0,3.39,3.44,3.48,3.53,3.59,3.63,3.68,3.73,3.77,3.98,4.37,4.37,4.37,4.37,4.37,4.7,4.7,4.7,4.7,4.78,5.13,5.13,5.26,5.31,5.31,5.55,5.55,5.55,5.67,5.72,6.1,6.1,6.18,6.18,6.23,6.48,6.63,6.63,6.63,6.63,6.63,6.63,6.63,6.63,6.63,6.63,6.63,6.63,6.63,6.63,6.63]
[17,0,0,0,0,0,0,0,0,0,0,0,0,0,0,0,0,0,0,0,0,0,0,0,0,0,0,0,0,0,0,0,0,0,0,0,0,0,0,0,0,0,0,0,0,0,0,0,0,3.39,3.44,3.48,3.53,3.59,3.63,3.68,3.73,3.77,3.98,4.37,4.37,4.37,4.37,4.37,4.7,4.7,4.7,4.7,4.78,5.13,5.13,5.26,5.31,5.31,5.55,5.55,5.55,5.67,5.72,6.1,6.1,6.18,6.18,6.23,6.48,6.63,6.63,6.63,6.63,6.63,6.63,6.63,6.63,6.63,6.63,6.63,6.63,6.63,6.63,6.63]
[18,0,0,0,0,0,0,0,0,0,0,0,0,0,0,0,0,0,0,0,0,0,0,0,0,0,0,0,0,0,0,0,0,0,0,0,0,0,0,0,0,0,0,0,0,0,0,0,0,3.39,3.44,3.48,3.53,3.59,3.63,3.68,3.73,3.77,3.98,4.37,4.37,4.37,4.37,4.37,4.7,4.7,4.7,4.7,4.78,5.13,5.13,5.26,5.31,5.31,5.55,5.55,5.55,5.67,5.72,6.1,6.1,6.18,6.18,6.23,6.48,6.63,6.63,6.63,6.63,6.63,6.63,6.63,6.63,6.63,6.63,6.63,6.63,6.63,6.63,6.63]
[19,0,0,0,0,0,0,0,0,0,0,0,0,0,0,0,0,0,0,0,0,0,0,0,0,0,0,0,0,0,0,0,0,0,0,0,0,0,0,0,0,0,0,0,0,0,0,0,0,3.39,3.44,3.48,3.53,3.59,3.63,3.68,3.73,3.77,3.98,4.37,4.37,4.37,4.37,4.37,4.7,4.7,4.7,4.7,4.78,5.13,5.13,5.26,5.31,5.31,5.55,5.55,5.55,5.67,5.72,6.1,6.1,6.18,6.18,6.23,6.48,6.63,6.63,6.63,6.63,6.63,6.63,6.63,6.63,6.63,6.63,6.63,6.63,6.63,6.63,6.63]
[20,0,0,0,0,0,0,0,0,0,0,0,0,0,0,0,0,0,0,0,0,0,0,0,0,0,0,0,0,0,0,0,0,0,0,0,0,0,0,0,0,0,0,0,0,0,0,0,0,3.39,3.44,3.48,3.53,3.59,3.63,3.68,3.73,3.77,3.98,4.37,4.37,4.37,4.37,4.37,4.7,4.7,4.7,4.7,4.78,5.13,5.13,5.26,5.31,5.31,5.55,5.55,5.55,5.67,5.72,6.1,6.1,6.18,6.18,6.23,6.48,6.63,6.63,6.63,6.63,6.63,6.63,6.63,6.63,6.63,6.63,6.63,6.63,6.63,6.63,6.63]
[21,0,0,0,0,0,0,0,0,0,0,0,0,0,0,0,0,0,0,0,0,0,0,0,0,0,0,0,0,0,0,0,0,0,0,0,0,0,0,0,0,0,0,0,0,0,0,0,0,3.39,3.44,3.48,3.53,3.59,3.63,3.68,3.73,3.77,3.98,4.37,4.37,4.37,4.37,4.37,4.7,4.7,4.7,4.7,4.78,5.13,5.13,5.26,5.31,5.31,5.55,5.55,5.55,5.67,5.72,6.1,6.1,6.18,6.18,6.23,6.48,6.63,6.63,6.63,6.63,6.63,6.63,6.63,6.63,6.63,6.63,6.63,6.63,6.63,6.63,6.63]
[22,0,0,0,0,0,0,0,0,0,0,0,0,0,0,0,0,0,0,0,0,0,0,0,0,0,0,0,0,0,0,0,0,0,0,0,0,0,0,0,0,0,0,0,0,0,0,0,0,3.39,3.44,3.48,3.53,3.59,3.63,3.68,3.73,3.77,3.98,4.37,4.37,4.37,4.37,4.37,4.7,4.7,4.7,4.7,4.78,5.13,5.13,5.26,5.31,5.31,5.55,5.55,5.55,5.67,5.72,6.1,6.1,6.18,6.18,6.23,6.48,6.63,6.63,6.63,6.63,6.63,6.63,6.63,6.63,6.63,6.63,6.63,6.63,6.63,6.63,6.63]
[23,0,0,0,0,0,0,0,0,0,0,0,0,0,0,0,0,0,0,0,0,0,0,0,0,0,0,0,0,0,0,0,0,0,0,0,0,0,0,0,0,0,0,0,0,0,0,0,0,3.39,3.44,3.48,3.53,3.59,3.63,3.68,3.73,3.77,3.98,4.37,4.37,4.37,4.37,4.37,4.7,4.7,4.7,4.7,4.78,5.13,5.13,5.26,5.31,5.31,5.55,5.55,5.55,5.67,5.72,6.1,6.1,6.18,6.18,6.23,6.48,6.63,6.63,6.63,6.63,6.63,6.63,6.63,6.63,6.63,6.63,6.63,6.63,6.63,6.63,6.63]
[24,0,0,0,0,0,0,0,0,0,0,0,0,0,0,0,0,0,0,0,0,0,0,0,0,0,0,0,0,0,0,0,0,0,0,0,0,0,0,0,0,0,0,0,0,0,0,0,0,3.39,3.44,3.48,3.53,3.59,3.63,3.68,3.73,3.77,3.98,4.37,4.37,4.37,4.37,4.37,4.7,4.7,4.7,4.7,4.78,5.13,5.13,5.26,5.31,5.31,5.55,5.55,5.55,5.67,5.72,6.1,6.1,6.18,6.18,6.23,6.48,6.63,6.63,6.63,6.63,6.63,6.63,6.63,6.63,6.63,6.63,6.63,6.63,6.63,6.63,6.63]
[25,0,0,0,0,0,0,0,0,0,0,0,0,0,0,0,0,0,0,0,0,0,0,0,0,0,0,0,0,0,0,0,0,0,0,0,0,0,0,0,0,0,0,0,0,0,0,0,0,3.39,3.44,3.48,3.53,3.59,3.63,3.68,3.73,3.77,3.98,4.37,4.37,4.37,4.37,4.37,4.7,4.7,4.7,4.7,4.78,5.13,5.13,5.26,5.31,5.31,5.55,5.55,5.55,5.67,5.72,6.1,6.1,6.18,6.18,6.23,6.48,6.63,6.63,6.63,6.63,6.63,6.63,6.63,6.63,6.63,6.63,6.63,6.63,6.63,6.63,6.63]
[26,0,0,0,0,0,0,0,0,0,0,0,0,0,0,0,0,0,0,0,0,0,0,0,0,0,0,0,0,0,0,0,0,0,0,0,0,0,0,0,0,0,0,0,0,0,0,0,0,3.39,3.44,3.48,3.53,3.59,3.63,3.68,3.73,3.77,3.98,4.37,4.37,4.37,4.37,4.37,4.7,4.7,4.7,4.7,4.78,5.13,5.13,5.26,5.31,5.31,5.55,5.55,5.55,5.67,5.72,6.1,6.1,6.18,6.18,6.23,6.48,6.63,6.63,6.63,6.63,6.63,6.63,6.63,6.63,6.63,6.63,6.63,6.63,6.63,6.63,6.63]
[27,0,0,0,0,0,0,0,0,0,0,0,0,0,0,0,0,0,0,0,0,0,0,0,0,0,0,0,0,0,0,0,0,0,0,0,0,0,0,0,0,0,0,0,0,0,0,0,0,3.39,3.44,3.48,3.53,3.59,3.63,3.68,3.73,3.77,3.98,4.37,4.37,4.37,4.37,4.37,4.7,4.7,4.7,4.7,4.78,5.13,5.13,5.26,5.31,5.31,5.55,5.55,5.55,5.67,5.72,6.1,6.1,6.18,6.18,6.23,6.48,6.63,6.63,6.63,6.63,6.63,6.63,6.63,6.63,6.63,6.63,6.63,6.63,6.63,6.63,6.63]
[28,0,0,0,0,0,0,0,0,0,0,0,0,0,0,0,0,0,0,0,0,0,0,0,0,0,0,0,0,0,0,0,0,0,0,0,0,0,0,0,0,0,0,0,0,0,0,0,0,3.39,3.44,3.48,3.53,3.59,3.63,3.68,3.73,3.77,3.98,4.37,4.37,4.37,4.37,4.37,4.7,4.7,4.7,4.7,4.78,5.13,5.13,5.26,5.31,5.31,5.55,5.55,5.55,5.67,5.72,6.1,6.1,6.18,6.18,6.23,6.48,6.63,6.63,6.63,6.63,6.63,6.63,6.63,6.63,6.63,6.63,6.63,6.63,6.63,6.63,6.63]
[29,0,0,0,0,0,0,0,0,0,0,0,0,0,0,0,0,0,0,0,0,0,0,0,0,0,0,0,0,0,0,0,0,0,0,0,0,0,0,0,0,0,0,0,0,0,0,0,0,3.39,3.44,3.48,3.53,3.59,3.63,3.68,3.73,3.77,3.98,4.37,4.37,4.37,4.37,4.37,4.7,4.7,4.7,4.7,4.78,5.13,5.13,5.26,5.31,5.31,5.55,5.55,5.55,5.67,5.72,6.1,6.1,6.18,6.18,6.23,6.48,6.63,6.63,6.63,6.63,6.63,6.63,6.63,6.63,6.63,6.63,6.63,6.63,6.63,6.63,6.63]
[30,0,0,0,0,0,0,0,0,0,0,0,0,0,0,0,0,0,0,0,0,0,0,0,0,0,0,0,0,0,0,0,0,0,0,0,0,0,0,0,0,0,0,0,0,0,0,0,0,3.39,3.44,3.48,3.53,3.59,3.63,3.68,3.73,3.77,3.98,4.37,4.37,4.37,4.37,4.37,4.7,4.7,4.7,4.7,4.78,5.13,5.13,5.26,5.31,5.31,5.55,5.55,5.55,5.67,5.72,6.1,6.1,6.18,6.18,6.23,6.48,6.63,6.63,6.63,6.63,6.63,6.63,6.63,6.63,6.63,6.63,6.63,6.63,6.63,6.63,6.63]
[31,0,0,0,0,0,0,0,0,0,0,0,0,0,0,0,0,0,0,0,0,0,0,0,0,0,0,0,0,0,0,0,0,0,0,0,0,0,0,0,0,0,0,0,0,0,0,0,0,3.39,3.44,3.48,3.53,3.59,3.63,3.68,3.73,3.77,3.98,4.37,4.37,4.37,4.37,4.37,4.7,4.7,4.7,4.7,4.78,5.13,5.13,5.26,5.31,5.31,5.55,5.55,5.55,5.67,5.72,6.1,6.1,6.18,6.18,6.23,6.48,6.63,6.63,6.63,6.63,6.63,6.63,6.63,6.63,6.63,6.63,6.63,6.63,6.63,6.63,6.63]
[32,0,0,0,0,0,0,0,0,0,0,0,0,0,0,0,0,0,0,0,0,0,0,0,0,0,0,0,0,0,0,0,0,0,0,0,0,0,0,0,0,0,0,0,0,0,0,0,0,3.39,3.44,3.48,3.53,3.59,3.63,3.68,3.73,3.77,3.98,4.37,4.37,4.37,4.37,4.37,4.7,4.7,4.7,4.7,4.78,5.13,5.13,5.26,5.31,5.31,5.55,5.55,5.55,5.67,5.72,6.1,6.1,6.18,6.18,6.23,6.48,6.63,6.63,6.63,6.63,6.63,6.63,6.63,6.63,6.63,6.63,6.63,6.63,6.63,6.63,6.63]
[33,0,0,0,0,0,0,0,0,0,0,0,0,0,0,0,0,0,0,0,0,0,0,0,0,0,0,0,0,0,0,0,0,0,0,0,0,0,0,0,0,0,0,0,0,0,0,0,0,3.39,3.44,3.48,3.53,3.59,3.63,3.68,3.73,3.77,3.98,4.37,4.37,4.37,4.37,4.37,4.7,4.7,4.7,4.7,4.78,5.13,5.13,5.26,5.31,5.31,5.55,5.55,5.55,5.67,5.72,6.1,6.1,6.18,6.18,6.23,6.48,6.63,6.63,6.63,6.63,6.63,6.63,6.63,6.63,6.63,6.63,6.63,6.63,6.63,6.63,6.63]
[34,0,0,0,0,0,0,0,0,0,0,0,0,0,0,0,0,0,0,0,0,0,0,0,0,0,0,0,0,0,0,0,0,0,0,0,0,0,0,0,0,0,0,0,0,0,0,0,0,3.39,3.44,3.48,3.53,3.59,3.63,3.68,3.73,3.77,3.98,4.37,4.37,4.37,4.37,4.37,4.7,4.7,4.7,4.7,4.78,5.13,5.13,5.26,5.31,5.31,5.55,5.55,5.55,5.67,5.72,6.1,6.1,6.18,6.18,6.23,6.48,6.63,6.63,6.63,6.63,6.63,6.63,6.63,6.63,6.63,6.63,6.63,6.63,6.63,6.63,6.63]
[35,0,0,0,0,0,0,0,0,0,0,0,0,0,0,0,0,0,0,0,0,0,0,0,0,0,0,0,0,0,0,0,0,0,0,0,0,0,0,0,0,0,0,0,0,0,0,0,0,3.39,3.44,3.48,3.53,3.59,3.63,3.68,3.73,3.77,3.98,4.37,4.37,4.37,4.37,4.37,4.7,4.7,4.7,4.7,4.78,5.13,5.13,5.26,5.31,5.31,5.55,5.55,5.55,5.67,5.72,6.1,6.1,6.18,6.18,6.23,6.48,6.63,6.63,6.63,6.63,6.63,6.63,6.63,6.63,6.63,6.63,6.63,6.63,6.63,6.63,6.63]
[36,0,0,0,0,0,0,0,0,0,0,0,0,0,0,0,0,0,0,0,0,0,0,0,0,0,0,0,0,0,0,0,0,0,0,0,0,0,0,0,0,0,0,0,0,0,0,0,0,3.39,3.44,3.48,3.53,3.59,3.63,3.68,3.73,3.77,3.98,4.37,4.37,4.37,4.37,4.37,4.7,4.7,4.7,4.7,4.78,5.13,5.13,5.26,5.31,5.31,5.55,5.55,5.55,5.67,5.72,6.1,6.1,6.18,6.18,6.23,6.48,6.63,6.63,6.63,6.63,6.63,6.63,6.63,6.63,6.63,6.63,6.63,6.63,6.63,6.63,6.63]
[37,0,0,0,0,0,0,0,0,0,0,0,0,0,0,0,0,0,0,0,0,0,0,0,0,0,0,0,0,0,0,0,0,0,0,0,0,0,0,0,0,0,0,0,0,0,0,0,0,3.39,3.44,3.48,3.53,3.59,3.63,3.68,3.73,3.77,3.98,4.37,4.37,4.37,4.37,4.37,4.7,4.7,4.7,4.7,4.78,5.13,5.13,5.26,5.31,5.31,5.55,5.55,5.55,5.67,5.72,6.1,6.1,6.18,6.18,6.23,6.48,6.63,6.63,6.63,6.63,6.63,6.63,6.63,6.63,6.63,6.63,6.63,6.63,6.63,6.63,6.63]
[38,0,0,0,0,0,0,0,0,0,0,0,0,0,0,0,0,0,0,0,0,0,0,0,0,0,0,0,0,0,0,0,0,0,0,0,0,0,0,0,0,0,0,0,0,0,0,0,0,3.39,3.44,3.48,3.53,3.59,3.63,3.68,3.73,3.77,3.98,4.37,4.37,4.37,4.37,4.37,4.7,4.7,4.7,4.7,4.78,5.13,5.13,5.26,5.31,5.31,5.55,5.55,5.55,5.67,5.72,6.1,6.1,6.18,6.18,6.23,6.48,6.63,6.63,6.63,6.63,6.63,6.63,6.63,6.63,6.63,6.63,6.63,6.63,6.63,6.63,6.63]
[39,0,0,0,0,0,0,0,0,0,0,0,0,0,0,0,0,0,0,0,0,0,0,0,0,0,0,0,0,0,0,0,0,0,0,0,0,0,0,0,0,0,0,0,0,0,0,0,0,3.39,3.44,3.48,3.53,3.59,3.63,3.68,3.73,3.77,3.98,4.37,4.37,4.37,4.37,4.37,4.7,4.7,4.7,4.7,4.78,5.13,5.13,5.26,5.31,5.31,5.55,5.55,5.55,5.67,5.72,6.1,6.1,6.18,6.18,6.23,6.48,6.63,6.63,6.63,6.63,6.63,6.63,6.63,6.63,6.63,6.63,6.63,6.63,6.63,6.63,6.63]
[40,0,0,0,0,0,0,0,0,0,0,0,0,0,0,0,0,0,0,0,0,0,0,0,0,0,0,0,0,0,0,0,0,0,0,0,0,0,0,0,0,0,0,0,0,0,0,0,0,3.39,3.44,3.48,3.53,3.59,3.63,3.68,3.73,3.77,3.98,4.37,4.37,4.37,4.37,4.37,4.7,4.7,4.7,4.7,4.78,5.13,5.13,5.26,5.31,5.31,5.55,5.55,5.55,5.67,5.72,6.1,6.1,6.18,6.18,6.23,6.48,6.63,6.63,6.63,6.63,6.63,6.63,6.63,6.63,6.63,6.63,6.63,6.63,6.63,6.63,6.63]
[41,0,0,0,0,0,0,0,0,0,0,0,0,0,0,0,0,0,0,0,0,0,0,0,0,0,0,0,0,0,0,0,0,0,0,0,0,0,0,0,0,0,0,0,0,0,0,0,0,3.39,3.44,3.48,3.53,3.59,3.63,3.68,3.73,3.77,3.98,4.37,4.37,4.37,4.37,4.37,4.7,4.7,4.7,4.7,4.78,5.13,5.13,5.26,5.31,5.31,5.55,5.55,5.55,5.67,5.72,6.1,6.1,6.18,6.18,6.23,6.48,6.63,6.63,6.63,6.63,6.63,6.63,6.63,6.63,6.63,6.63,6.63,6.63,6.63,6.63,6.63]
[42,0,0,0,0,0,0,0,0,0,0,0,0,0,0,0,0,0,0,0,0,0,0,0,0,0,0,0,0,0,0,0,0,0,0,0,0,0,0,0,0,0,0,0,0,0,0,0,0,3.39,3.44,3.48,3.53,3.59,3.63,3.68,3.73,3.77,3.98,4.37,4.37,4.37,4.37,4.37,4.7,4.7,4.7,4.7,4.78,5.13,5.13,5.26,5.31,5.31,5.55,5.55,5.55,5.67,5.72,6.1,6.1,6.18,6.18,6.23,6.48,6.63,6.63,6.63,6.63,6.63,6.63,6.63,6.63,6.63,6.63,6.63,6.63,6.63,6.63,6.63]
[43,0,0,0,0,0,0,0,0,0,0,0,0,0,0,0,0,0,0,0,0,0,0,0,0,0,0,0,0,0,0,0,0,0,0,0,0,0,0,0,0,0,0,0,0,0,0,0,0,3.39,3.44,3.48,3.53,3.59,3.63,3.68,3.73,3.77,3.98,4.37,4.37,4.37,4.37,4.37,4.7,4.7,4.7,4.7,4.78,5.13,5.13,5.26,5.31,5.31,5.55,5.55,5.55,5.67,5.72,6.1,6.1,6.18,6.18,6.23,6.48,6.63,6.63,6.63,6.63,6.63,6.63,6.63,6.63,6.63,6.63,6.63,6.63,6.63,6.63,6.63]
[44,0,0,0,0,0,0,0,0,0,0,0,0,0,0,0,0,0,0,0,0,0,0,0,0,0,0,0,0,0,0,0,0,0,0,0,0,0,0,0,0,0,0,0,0,0,0,0,0,3.39,3.44,3.48,3.53,3.59,3.63,3.68,3.73,3.77,3.98,4.37,4.37,4.37,4.37,4.37,4.7,4.7,4.7,4.7,4.78,5.13,5.13,5.26,5.31,5.31,5.55,5.55,5.55,5.67,5.72,6.1,6.1,6.18,6.18,6.23,6.48,6.63,6.63,6.63,6.63,6.63,6.63,6.63,6.63,6.63,6.63,6.63,6.63,6.63,6.63,6.63]
[45,0,0,0,0,0,0,0,0,0,0,0,0,0,0,0,0,0,0,0,0,0,0,0,0,0,0,0,0,0,0,0,0,0,0,0,0,0,0,0,0,0,0,0,0,0,0,0,0,3.39,3.44,3.48,3.53,3.59,3.63,3.68,3.73,3.77,3.98,4.37,4.37,4.37,4.37,4.37,4.7,4.7,4.7,4.7,4.78,5.13,5.13,5.26,5.31,5.31,5.55,5.55,5.55,5.67,5.72,6.1,6.1,6.18,6.18,6.23,6.48,6.63,6.63,6.63,6.63,6.63,6.63,6.63,6.63,6.63,6.63,6.63,6.63,6.63,6.63,6.63]
[46,0,0,0,0,0,0,0,0,0,0,0,0,0,0,0,0,0,0,0,0,0,0,0,0,0,0,0,0,0,0,0,0,0,0,0,0,0,0,0,0,0,0,0,0,0,0,0,0,3.24,3.44,3.48,3.53,3.59,3.63,3.68,3.73,3.77,3.98,4.37,4.37,4.37,4.37,4.37,4.7,4.7,4.7,4.7,4.78,5.13,5.13,5.26,5.31,5.31,5.55,5.55,5.55,5.67,5.72,6.1,6.1,6.18,6.18,6.23,6.48,6.63,6.63,6.63,6.63,6.63,6.63,6.63,6.63,6.63,6.63,6.63,6.63,6.63,6.63,6.63]
[47,0,0,0,0,0,0,0,0,0,0,0,0,0,0,0,0,0,0,0,0,0,0,0,0,0,0,0,0,0,0,0,0,0,0,0,0,0,0,0,0,0,0,0,0,0,0,0,0,3.06,3.28,3.48,3.53,3.59,3.63,3.68,3.73,3.77,3.98,4.37,4.37,4.37,4.37,4.37,4.7,4.7,4.7,4.7,4.78,5.13,5.13,5.26,5.31,5.31,5.55,5.55,5.55,5.67,5.72,6.1,6.1,6.18,6.18,6.23,6.48,6.63,6.63,6.63,6.63,6.63,6.63,6.63,6.63,6.63,6.63,6.63,6.63,6.63,6.63,6.63]
[48,0,0,0,0,0,0,0,0,0,0,0,0,0,0,0,0,0,0,0,0,0,0,0,0,0,0,0,0,0,0,0,0,0,0,0,0,0,0,0,0,0,0,0,0,0,0,0,0,3.39,3.36,3.33,3.53,3.59,3.63,3.68,3.73,3.77,3.98,4.37,4.37,4.37,4.37,4.37,4.7,4.7,4.7,4.7,4.78,5.13,5.13,5.26,5.31,5.31,5.55,5.55,5.55,5.67,5.72,6.1,6.1,6.18,6.18,6.23,6.48,6.63,6.63,6.63,6.63,6.63,6.63,6.63,6.63,6.63,6.63,6.63,6.63,6.63,6.63,6.63]
[49,0,0,0,0,0,0,0,0,0,0,0,0,0,0,0,0,0,0,0,0,0,0,0,0,0,0,0,0,0,0,0,0,0,0,0,0,0,0,0,0,0,0,0,0,0,0,0,0,3.39,3.44,3.35,3.38,3.59,3.63,3.68,3.73,3.77,3.98,4.37,4.37,4.37,4.37,4.37,4.7,4.7,4.7,4.7,4.78,5.13,5.13,5.26,5.31,5.31,5.55,5.55,5.55,5.67,5.72,6.1,6.1,6.18,6.18,6.23,6.48,6.63,6.63,6.63,6.63,6.63,6.63,6.63,6.63,6.63,6.63,6.63,6.63,6.63,6.63,6.63]
[50,0,0,0,0,0,0,0,0,0,0,0,0,0,0,0,0,0,0,0,0,0,0,0,0,0,0,0,0,0,0,0,0,0,0,0,0,0,0,0,0,0,0,0,0,0,0,0,0,3.39,3.44,3.48,3.39,3.43,3.63,3.68,3.73,3.77,3.98,4.37,4.37,4.37,4.37,4.37,4.7,4.7,4.7,4.7,4.78,5.13,5.13,5.26,5.31,5.31,5.55,5.55,5.55,5.67,5.72,6.1,6.1,6.18,6.18,6.23,6.48,6.63,6.63,6.63,6.63,6.63,6.63,6.63,6.63,6.63,6.63,6.63,6.63,6.63,6.63,6.63]
[51,0,0,0,0,0,0,0,0,0,0,0,0,0,0,0,0,0,0,0,0,0,0,0,0,0,0,0,0,0,0,0,0,0,0,0,0,0,0,0,0,0,0,0,0,0,0,0,0,0,3.44,3.48,3.53,3.44,3.48,3.68,3.73,3.77,3.98,4.37,4.37,4.37,4.37,4.37,4.7,4.7,4.7,4.7,4.78,5.13,5.13,5.26,5.31,5.31,5.55,5.55,5.55,5.67,5.72,6.1,6.1,6.18,6.18,6.23,6.48,6.63,6.63,6.63,6.63,6.63,6.63,6.63,6.63,6.63,6.63,6.63,6.63,6.63,6.63,6.63]
[52,0,0,0,0,0,0,0,0,0,0,0,0,0,0,0,0,0,0,0,0,0,0,0,0,0,0,0,0,0,0,0,0,0,0,0,0,0,0,0,0,0,0,0,0,0,0,0,0,0,0,3.48,3.53,3.59,3.5,3.54,3.73,3.77,3.98,4.37,4.37,4.37,4.37,4.37,4.7,4.7,4.7,4.7,4.78,5.13,5.13,5.26,5.31,5.31,5.55,5.55,5.55,5.67,5.72,6.1,6.1,6.18,6.18,6.23,6.48,6.63,6.63,6.63,6.63,6.63,6.63,6.63,6.63,6.63,6.63,6.63,6.63,6.63,6.63,6.63]
[53,0,0,0,0,0,0,0,0,0,0,0,0,0,0,0,0,0,0,0,0,0,0,0,0,0,0,0,0,0,0,0,0,0,0,0,0,0,0,0,0,0,0,0,0,0,0,0,0,0,0,0,3.53,3.59,3.63,3.54,3.6,3.77,3.98,4.37,4.37,4.37,4.37,4.37,4.7,4.7,4.7,4.7,4.78,5.13,5.13,5.26,5.31,5.31,5.55,5.55,5.55,5.67,5.72,6.1,6.1,6.18,6.18,6.23,6.48,6.63,6.63,6.63,6.63,6.63,6.63,6.63,6.63,6.63,6.63,6.63,6.63,6.63,6.63,6.63]
[54,0,0,0,0,0,0,0,0,0,0,0,0,0,0,0,0,0,0,0,0,0,0,0,0,0,0,0,0,0,0,0,0,0,0,0,0,0,0,0,0,0,0,0,0,0,0,0,0,0,0,0,0,3.59,3.63,3.68,3.6,3.66,3.91,4.25,4.37,4.37,4.37,4.37,4.7,4.7,4.7,4.7,4.78,5.13,5.13,5.26,5.31,5.31,5.55,5.55,5.55,5.67,5.72,6.1,6.1,6.18,6.18,6.23,6.48,6.63,6.63,6.63,6.63,6.63,6.63,6.63,6.63,6.63,6.63,6.63,6.63,6.63,6.63,6.63]
[55,0,0,0,0,0,0,0,0,0,0,0,0,0,0,0,0,0,0,0,0,0,0,0,0,0,0,0,0,0,0,0,0,0,0,0,0,0,0,0,0,0,0,0,0,0,0,0,0,0,0,0,0,0,3.63,3.68,3.73,3.64,3.73,4.0199999999999996,4.3,4.37,4.37,4.37,4.7,4.7,4.7,4.7,4.78,5.13,5.13,5.26,5.31,5.31,5.55,5.55,5.55,5.67,5.72,6.1,6.1,6.18,6.18,6.23,6.48,6.63,6.63,6.63,6.63,6.63,6.63,6.63,6.63,6.63,6.63,6.63,6.63,6.63,6.63,6.63]
[56,0,0,0,0,0,0,0,0,0,0,0,0,0,0,0,0,0,0,0,0,0,0,0,0,0,0,0,0,0,0,0,0,0,0,0,0,0,0,0,0,0,0,0,0,0,0,0,0,0,0,0,0,0,0,3.68,3.73,3.77,3.68,4.4800000000000004,4.37,4.37,4.37,4.37,4.7,4.7,4.7,4.7,4.78,5.13,5.13,5.26,5.31,5.31,5.55,5.55,5.55,5.67,5.72,6.1,6.1,6.18,6.18,6.23,6.48,6.63,6.63,6.63,6.63,6.63,6.63,6.63,6.63,6.63,6.63,6.63,6.63,6.63,6.63,6.63]
[57,0,0,0,0,0,0,0,0,0,0,0,0,0,0,0,0,0,0,0,0,0,0,0,0,0,0,0,0,0,0,0,0,0,0,0,0,0,0,0,0,0,0,0,0,0,0,0,0,0,0,0,0,0,0,0,3.73,3.77,3.98,4.37,4.37,4.37,4.37,4.37,4.7,4.7,4.7,4.7,4.78,5.13,5.13,5.26,5.31,5.31,5.55,5.55,5.55,5.67,5.72,6.1,6.1,6.18,6.18,6.23,6.48,6.63,6.63,6.63,6.63,6.63,6.63,6.63,6.63,6.63,6.63,6.63,6.63,6.63,6.63,6.63]
[58,0,0,0,0,0,0,0,0,0,0,0,0,0,0,0,0,0,0,0,0,0,0,0,0,0,0,0,0,0,0,0,0,0,0,0,0,0,0,0,0,0,0,0,0,0,0,0,0,0,0,0,0,0,0,0,0,3.77,4,4.37,4.37,4.37,4.37,4.37,4.7,4.7,4.7,4.7,4.78,5.13,5.13,5.26,5.31,5.31,5.55,5.55,5.55,5.67,5.72,6.1,6.1,6.18,6.18,6.23,6.48,6.63,6.63,6.63,6.63,6.63,6.63,6.63,6.63,6.63,6.63,6.63,6.63,6.63,6.63,6.63]
[59,0,0,0,0,0,0,0,0,0,0,0,0,0,0,0,0,0,0,0,0,0,0,0,0,0,0,0,0,0,0,0,0,0,0,0,0,0,0,0,0,0,0,0,0,0,0,0,0,0,0,0,0,0,0,0,0,0,3.83,4.3899999999999997,4.37,4.37,4.37,4.37,4.7,4.7,4.7,4.7,4.78,5.13,5.13,5.26,5.31,5.31,5.55,5.55,5.55,5.67,5.72,6.1,6.1,6.18,6.18,6.23,6.48,6.63,6.63,6.63,6.63,6.63,6.63,6.63,6.63,6.63,6.63,6.63,6.63,6.63,6.63,6.63]
[60,0,0,0,0,0,0,0,0,0,0,0,0,0,0,0,0,0,0,0,0,0,0,0,0,0,0,0,0,0,0,0,0,0,0,0,0,0,0,0,0,0,0,0,0,0,0,0,0,0,0,0,0,0,0,0,0,0,0,4.34,4.3899999999999997,4.37,4.37,4.37,4.7,4.7,4.7,4.7,4.78,5.13,5.13,5.26,5.31,5.31,5.55,5.55,5.55,5.67,5.72,6.1,6.1,6.18,6.18,6.23,6.48,6.63,6.63,6.63,6.63,6.63,6.63,6.63,6.63,6.63,6.63,6.63,6.63,6.63,6.63,6.63]
[61,0,0,0,0,0,0,0,0,0,0,0,0,0,0,0,0,0,0,0,0,0,0,0,0,0,0,0,0,0,0,0,0,0,0,0,0,0,0,0,0,0,0,0,0,0,0,0,0,0,0,0,0,0,0,0,0,0,0,0,4.34,4.4000000000000004,4.37,4.37,4.7,4.7,4.7,4.7,4.78,5.13,5.13,5.26,5.31,5.31,5.55,5.55,5.55,5.67,5.72,6.1,6.1,6.18,6.18,6.23,6.48,6.63,6.63,6.63,6.63,6.63,6.63,6.63,6.63,6.63,6.63,6.63,6.63,6.63,6.63,6.63]
[62,0,0,0,0,0,0,0,0,0,0,0,0,0,0,0,0,0,0,0,0,0,0,0,0,0,0,0,0,0,0,0,0,0,0,0,0,0,0,0,0,0,0,0,0,0,0,0,0,0,0,0,0,0,0,0,0,0,0,0,0,4.34,4.4000000000000004,4.37,4.7,4.7,4.7,4.7,4.78,5.13,5.13,5.26,5.31,5.31,5.55,5.55,5.55,5.67,5.72,6.1,6.1,6.18,6.18,6.23,6.48,6.63,6.63,6.63,6.63,6.63,6.63,6.63,6.63,6.63,6.63,6.63,6.63,6.63,6.63,6.63]
[63,0,0,0,0,0,0,0,0,0,0,0,0,0,0,0,0,0,0,0,0,0,0,0,0,0,0,0,0,0,0,0,0,0,0,0,0,0,0,0,0,0,0,0,0,0,0,0,0,0,0,0,0,0,0,0,0,0,0,0,0,0,4.34,4.4000000000000004,4.7,4.7,4.7,4.7,4.78,5.13,5.13,5.26,5.31,5.31,5.55,5.55,5.55,5.67,5.72,6.1,6.1,6.18,6.18,6.23,6.48,6.63,6.63,6.63,6.63,6.63,6.63,6.63,6.63,6.63,6.63,6.63,6.63,6.63,6.63,6.63]
[64,0,0,0,0,0,0,0,0,0,0,0,0,0,0,0,0,0,0,0,0,0,0,0,0,0,0,0,0,0,0,0,0,0,0,0,0,0,0,0,0,0,0,0,0,0,0,0,0,0,0,0,0,0,0,0,0,0,0,0,0,0,0,4.34,4.76,4.7,4.7,4.7,4.78,5.13,5.13,5.26,5.31,5.31,5.55,5.55,5.55,5.67,5.72,6.1,6.1,6.18,6.18,6.23,6.48,6.63,6.63,6.63,6.63,6.63,6.63,6.63,6.63,6.63,6.63,6.63,6.63,6.63,6.63,6.63]
[65,0,0,0,0,0,0,0,0,0,0,0,0,0,0,0,0,0,0,0,0,0,0,0,0,0,0,0,0,0,0,0,0,0,0,0,0,0,0,0,0,0,0,0,0,0,0,0,0,0,0,0,0,0,0,0,0,0,0,0,0,0,0,0,4.3600000000000003,4.76,4.7,4.7,4.78,5.13,5.13,5.26,5.31,5.31,5.55,5.55,5.55,5.67,5.72,6.1,6.1,6.18,6.18,6.23,6.48,6.63,6.63,6.63,6.63,6.63,6.63,6.63,6.63,6.63,6.63,6.63,6.63,6.63,6.63,6.63]
[66,0,0,0,0,0,0,0,0,0,0,0,0,0,0,0,0,0,0,0,0,0,0,0,0,0,0,0,0,0,0,0,0,0,0,0,0,0,0,0,0,0,0,0,0,0,0,0,0,0,0,0,0,0,0,0,0,0,0,0,0,0,0,0,0,4.3899999999999997,4.76,4.7,4.78,5.13,5.13,5.26,5.31,5.31,5.55,5.55,5.55,5.67,5.72,6.1,6.1,6.18,6.18,6.23,6.48,6.63,6.63,6.63,6.63,6.63,6.63,6.63,6.63,6.63,6.63,6.63,6.63,6.63,6.63,6.63]
[67,0,0,0,0,0,0,0,0,0,0,0,0,0,0,0,0,0,0,0,0,0,0,0,0,0,0,0,0,0,0,0,0,0,0,0,0,0,0,0,0,0,0,0,0,0,0,0,0,0,0,0,0,0,0,0,0,0,0,0,0,0,0,0,0,0,4.42,4.76,4.78,5.13,5.13,5.26,5.31,5.31,5.55,5.55,5.55,5.67,5.72,6.1,6.1,6.18,6.18,6.23,6.48,6.63,6.63,6.63,6.63,6.63,6.63,6.63,6.63,6.63,6.63,6.63,6.63,6.63,6.63,6.63]
[68,0,0,0,0,0,0,0,0,0,0,0,0,0,0,0,0,0,0,0,0,0,0,0,0,0,0,0,0,0,0,0,0,0,0,0,0,0,0,0,0,0,0,0,0,0,0,0,0,0,0,0,0,0,0,0,0,0,0,0,0,0,0,0,0,0,0,4.45,4.8499999999999996,5.13,5.13,5.26,5.31,5.31,5.55,5.55,5.55,5.67,5.72,6.1,6.1,6.18,6.18,6.23,6.48,6.63,6.63,6.63,6.63,6.63,6.63,6.63,6.63,6.63,6.63,6.63,6.63,6.63,6.63,6.63]
[69,0,0,0,0,0,0,0,0,0,0,0,0,0,0,0,0,0,0,0,0,0,0,0,0,0,0,0,0,0,0,0,0,0,0,0,0,0,0,0,0,0,0,0,0,0,0,0,0,0,0,0,0,0,0,0,0,0,0,0,0,0,0,0,0,0,0,0,4.45,5.25,5.13,5.16,5.31,5.31,5.55,5.55,5.55,5.67,5.72,6.1,6.1,6.18,6.18,6.23,6.48,6.63,6.63,6.63,6.63,6.63,6.63,6.63,6.63,6.63,6.63,6.63,6.63,6.63,6.63,6.63]
[70,0,0,0,0,0,0,0,0,0,0,0,0,0,0,0,0,0,0,0,0,0,0,0,0,0,0,0,0,0,0,0,0,0,0,0,0,0,0,0,0,0,0,0,0,0,0,0,0,0,0,0,0,0,0,0,0,0,0,0,0,0,0,0,0,0,0,0,0,4.72,5.25,5.26,5.21,5.31,5.55,5.55,5.55,5.67,5.72,6.1,6.1,6.18,6.18,6.23,6.48,6.63,6.63,6.63,6.63,6.63,6.63,6.63,6.63,6.63,6.63,6.63,6.63,6.63,6.63,6.63]
[71,0,0,0,0,0,0,0,0,0,0,0,0,0,0,0,0,0,0,0,0,0,0,0,0,0,0,0,0,0,0,0,0,0,0,0,0,0,0,0,0,0,0,0,0,0,0,0,0,0,0,0,0,0,0,0,0,0,0,0,0,0,0,0,0,0,0,0,0,0,4.87,5.25,5.3,5.26,5.55,5.55,5.55,5.67,5.72,6.1,6.1,6.18,6.18,6.23,6.48,6.63,6.63,6.63,6.63,6.63,6.63,6.63,6.63,6.63,6.63,6.63,6.63,6.63,6.63,6.63]
[72,0,0,0,0,0,0,0,0,0,0,0,0,0,0,0,0,0,0,0,0,0,0,0,0,0,0,0,0,0,0,0,0,0,0,0,0,0,0,0,0,0,0,0,0,0,0,0,0,0,0,0,0,0,0,0,0,0,0,0,0,0,0,0,0,0,0,0,0,0,0,4.87,5.26,5.3,5.55,5.55,5.55,5.67,5.72,6.1,6.1,6.18,6.18,6.23,6.48,6.63,6.63,6.63,6.63,6.63,6.63,6.63,6.63,6.63,6.63,6.63,6.63,6.63,6.63,6.63]
[73,0,0,0,0,0,0,0,0,0,0,0,0,0,0,0,0,0,0,0,0,0,0,0,0,0,0,0,0,0,0,0,0,0,0,0,0,0,0,0,0,0,0,0,0,0,0,0,0,0,0,0,0,0,0,0,0,0,0,0,0,0,0,0,0,0,0,0,0,0,0,0,4.87,5.31,5.54,5.55,5.55,5.67,5.72,6.1,6.1,6.18,6.18,6.23,6.48,6.63,6.63,6.63,6.63,6.63,6.63,6.63,6.63,6.63,6.63,6.63,6.63,6.63,6.63,6.63]
[74,0,0,0,0,0,0,0,0,0,0,0,0,0,0,0,0,0,0,0,0,0,0,0,0,0,0,0,0,0,0,0,0,0,0,0,0,0,0,0,0,0,0,0,0,0,0,0,0,0,0,0,0,0,0,0,0,0,0,0,0,0,0,0,0,0,0,0,0,0,0,0,0,4.87,5.67,5.55,5.55,5.67,5.72,6.1,6.1,6.18,6.18,6.23,6.48,6.63,6.63,6.63,6.63,6.63,6.63,6.63,6.63,6.63,6.63,6.63,6.63,6.63,6.63,6.63]
[75,0,0,0,0,0,0,0,0,0,0,0,0,0,0,0,0,0,0,0,0,0,0,0,0,0,0,0,0,0,0,0,0,0,0,0,0,0,0,0,0,0,0,0,0,0,0,0,0,0,0,0,0,0,0,0,0,0,0,0,0,0,0,0,0,0,0,0,0,0,0,0,0,0,5.19,5.67,5.55,5.67,5.72,6.1,6.1,6.18,6.18,6.23,6.48,6.63,6.63,6.63,6.63,6.63,6.63,6.63,6.63,6.63,6.63,6.63,6.63,6.63,6.63,6.63]
[76,0,0,0,0,0,0,0,0,0,0,0,0,0,0,0,0,0,0,0,0,0,0,0,0,0,0,0,0,0,0,0,0,0,0,0,0,0,0,0,0,0,0,0,0,0,0,0,0,0,0,0,0,0,0,0,0,0,0,0,0,0,0,0,0,0,0,0,0,0,0,0,0,0,0,5.21,5.67,5.67,5.72,6.1,6.1,6.18,6.18,6.23,6.48,6.63,6.63,6.63,6.63,6.63,6.63,6.63,6.63,6.63,6.63,6.63,6.63,6.63,6.63,6.63]
[77,0,0,0,0,0,0,0,0,0,0,0,0,0,0,0,0,0,0,0,0,0,0,0,0,0,0,0,0,0,0,0,0,0,0,0,0,0,0,0,0,0,0,0,0,0,0,0,0,0,0,0,0,0,0,0,0,0,0,0,0,0,0,0,0,0,0,0,0,0,0,0,0,0,0,0,5.26,5.67,5.72,6.1,6.1,6.18,6.18,6.23,6.48,6.63,6.63,6.63,6.63,6.63,6.63,6.63,6.63,6.63,6.63,6.63,6.63,6.63,6.63,6.63]
[78,0,0,0,0,0,0,0,0,0,0,0,0,0,0,0,0,0,0,0,0,0,0,0,0,0,0,0,0,0,0,0,0,0,0,0,0,0,0,0,0,0,0,0,0,0,0,0,0,0,0,0,0,0,0,0,0,0,0,0,0,0,0,0,0,0,0,0,0,0,0,0,0,0,0,0,0,5.31,5.77,6.1,6.1,6.18,6.18,6.23,6.48,6.63,6.63,6.63,6.63,6.63,6.63,6.63,6.63,6.63,6.63,6.63,6.63,6.63,6.63,6.63]
[79,0,0,0,0,0,0,0,0,0,0,0,0,0,0,0,0,0,0,0,0,0,0,0,0,0,0,0,0,0,0,0,0,0,0,0,0,0,0,0,0,0,0,0,0,0,0,0,0,0,0,0,0,0,0,0,0,0,0,0,0,0,0,0,0,0,0,0,0,0,0,0,0,0,0,0,0,0,5.36,6.17,6.1,6.18,6.18,6.23,6.48,6.63,6.63,6.63,6.63,6.63,6.63,6.63,6.63,6.63,6.63,6.63,6.63,6.63,6.63,6.63]
[80,0,0,0,0,0,0,0,0,0,0,0,0,0,0,0,0,0,0,0,0,0,0,0,0,0,0,0,0,0,0,0,0,0,0,0,0,0,0,0,0,0,0,0,0,0,0,0,0,0,0,0,0,0,0,0,0,0,0,0,0,0,0,0,0,0,0,0,0,0,0,0,0,0,0,0,0,0,0,5.61,6.18,6.18,6.18,6.23,6.48,6.63,6.63,6.63,6.63,6.63,6.63,6.63,6.63,6.63,6.63,6.63,6.63,6.63,6.63,6.63]
[81,0,0,0,0,0,0,0,0,0,0,0,0,0,0,0,0,0,0,0,0,0,0,0,0,0,0,0,0,0,0,0,0,0,0,0,0,0,0,0,0,0,0,0,0,0,0,0,0,0,0,0,0,0,0,0,0,0,0,0,0,0,0,0,0,0,0,0,0,0,0,0,0,0,0,0,0,0,0,0,5.67,6.18,6.18,6.18,6.35,6.63,6.63,6.63,6.63,6.63,6.63,6.63,6.63,6.63,6.63,6.63,6.63,6.63,6.63,6.63]
[82,0,0,0,0,0,0,0,0,0,0,0,0,0,0,0,0,0,0,0,0,0,0,0,0,0,0,0,0,0,0,0,0,0,0,0,0,0,0,0,0,0,0,0,0,0,0,0,0,0,0,0,0,0,0,0,0,0,0,0,0,0,0,0,0,0,0,0,0,0,0,0,0,0,0,0,0,0,0,0,0,5.72,6.23,6.23,6.18,6.41,6.63,6.63,6.63,6.63,6.63,6.63,6.63,6.63,6.63,6.63,6.63,6.63,6.63,6.63]
[83,0,0,0,0,0,0,0,0,0,0,0,0,0,0,0,0,0,0,0,0,0,0,0,0,0,0,0,0,0,0,0,0,0,0,0,0,0,0,0,0,0,0,0,0,0,0,0,0,0,0,0,0,0,0,0,0,0,0,0,0,0,0,0,0,0,0,0,0,0,0,0,0,0,0,0,0,0,0,0,0,0,5.72,6.23,6.48,6.32,6.48,6.63,6.63,6.63,6.63,6.63,6.63,6.63,6.63,6.63,6.63,6.63,6.63,6.63]
[84,0,0,0,0,0,0,0,0,0,0,0,0,0,0,0,0,0,0,0,0,0,0,0,0,0,0,0,0,0,0,0,0,0,0,0,0,0,0,0,0,0,0,0,0,0,0,0,0,0,0,0,0,0,0,0,0,0,0,0,0,0,0,0,0,0,0,0,0,0,0,0,0,0,0,0,0,0,0,0,0,0,0,5.77,6.58,6.63,6.48,6.59,6.63,6.63,6.63,6.63,6.63,6.63,6.63,6.63,6.63,6.63,6.63,6.63]
[85,0,0,0,0,0,0,0,0,0,0,0,0,0,0,0,0,0,0,0,0,0,0,0,0,0,0,0,0,0,0,0,0,0,0,0,0,0,0,0,0,0,0,0,0,0,0,0,0,0,0,0,0,0,0,0,0,0,0,0,0,0,0,0,0,0,0,0,0,0,0,0,0,0,0,0,0,0,0,0,0,0,0,0,5.82,6.58,6.63,6.53,6.63,6.63,6.63,6.63,6.63,6.63,6.63,6.63,6.63,6.63,6.63,6.63]

{"sheet":"PIATomorrowSingle","index":10,"n_rows":85,"n_cols":125,"rows_kept":85,"cut":false,"hidden":true,"merged":[]}
[1,{"$f":"A1+1","v":2},{"$f":"B1+1","v":3},4,5,6,7,8,9,10,11,12,13,14,15,16,17,18,19,20,21,22,23,24,25,26,27,28,29,30,31,32,33,34,35,36,37,38,39,40,41,42,43,44,45,46,47,48,49,50,{"$f":"AX1+1","v":51},{"$f":"AY1+1","v":52},53,54,55,56,57,58,59,60,61,62,63,64,65,66,67,68,69,70,71,72,73,74,75,76,77,78,79,80,81,82,83,84,85,86,87,88,89,90,91,92,93,94,95,96,97,98,99,100,101,102,103,104,105]
[{"$f":"A1+1","v":2},0,0,0,0,0,0,0,0,0,0,0,0,0,0,0,0,0,0,0,0,0,0,0,0,0,0,0,0,0,0,0,0,0,0,0,0,0,0,0,0,0,0,0,0,0,0,0,0,2.96,3.02,3.08,3.15,3.21,3.27,3.33,3.39,3.47,3.54,3.76,3.82,3.92,3.97,4.07,4.12,4.2300000000000004,4.54,4.54,4.54,4.99,4.99,4.99,5.15,5.15,5.46,5.46,5.67,5.77,5.88,5.93,5.93,5.93,5.93,5.93,6.08,6.08,6.08,6.08,6.08,6.08,6.08,6.08,6.08,6.18,6.18,6.18,6.18,6.18,6.18,6.18,6.18,6.18,6.18,6.18,6.18,null,null,null,null,null,null,null,null,null,null,null,null,null,null,null,null,null,97,98,"99-105"]
[{"$f":"A2+1","v":3},0,0,0,0,0,0,0,0,0,0,0,0,0,0,0,0,0,0,0,0,0,0,0,0,0,0,0,0,0,0,0,0,0,0,0,0,0,0,0,0,0,0,0,0,0,0,0,0,2.96,3.02,3.08,3.15,3.21,3.27,3.33,3.39,3.47,3.54,3.76,3.82,3.92,3.97,4.07,4.12,4.2300000000000004,4.54,4.54,4.54,4.99,4.99,4.99,5.15,5.15,5.46,5.46,5.67,5.77,5.88,5.93,5.93,5.93,5.93,5.93,6.08,6.08,6.08,6.08,6.08,6.08,6.08,6.08,6.08,6.18,6.18,6.18,6.18,6.18,6.18,6.18,6.18,6.18,6.18,6.18,6.18]
[4,0,0,0,0,0,0,0,0,0,0,0,0,0,0,0,0,0,0,0,0,0,0,0,0,0,0,0,0,0,0,0,0,0,0,0,0,0,0,0,0,0,0,0,0,0,0,0,0,2.96,3.02,3.08,3.15,3.21,3.27,3.33,3.39,3.47,3.54,3.76,3.82,3.92,3.97,4.07,4.12,4.2300000000000004,4.54,4.54,4.54,4.99,4.99,4.99,5.15,5.15,5.46,5.46,5.67,5.77,5.88,5.93,5.93,5.93,5.93,5.93,6.08,6.08,6.08,6.08,6.08,6.08,6.08,6.08,6.08,6.18,6.18,6.18,6.18,6.18,6.18,6.18,6.18,6.18,6.18,6.18,6.18]
[5,0,0,0,0,0,0,0,0,0,0,0,0,0,0,0,0,0,0,0,0,0,0,0,0,0,0,0,0,0,0,0,0,0,0,0,0,0,0,0,0,0,0,0,0,0,0,0,0,2.96,3.02,3.08,3.15,3.21,3.27,3.33,3.39,3.47,3.54,3.76,3.82,3.92,3.97,4.07,4.12,4.2300000000000004,4.54,4.54,4.54,4.99,4.99,4.99,5.15,5.15,5.46,5.46,5.67,5.77,5.88,5.93,5.93,5.93,5.93,5.93,6.08,6.08,6.08,6.08,6.08,6.08,6.08,6.08,6.08,6.18,6.18,6.18,6.18,6.18,6.18,6.18,6.18,6.18,6.18,6.18,6.18]
[6,0,0,0,0,0,0,0,0,0,0,0,0,0,0,0,0,0,0,0,0,0,0,0,0,0,0,0,0,0,0,0,0,0,0,0,0,0,0,0,0,0,0,0,0,0,0,0,0,2.96,3.02,3.08,3.15,3.21,3.27,3.33,3.39,3.47,3.54,3.76,3.82,3.92,3.97,4.07,4.12,4.2300000000000004,4.54,4.54,4.54,4.99,4.99,4.99,5.15,5.15,5.46,5.46,5.67,5.77,5.88,5.93,5.93,5.93,5.93,5.93,6.08,6.08,6.08,6.08,6.08,6.08,6.08,6.08,6.08,6.18,6.18,6.18,6.18,6.18,6.18,6.18,6.18,6.18,6.18,6.18,6.18]
[7,0,0,0,0,0,0,0,0,0,0,0,0,0,0,0,0,0,0,0,0,0,0,0,0,0,0,0,0,0,0,0,0,0,0,0,0,0,0,0,0,0,0,0,0,0,0,0,0,2.96,3.02,3.08,3.15,3.21,3.27,3.33,3.39,3.47,3.54,3.76,3.82,3.92,3.97,4.07,4.12,4.2300000000000004,4.54,4.54,4.54,4.99,4.99,4.99,5.15,5.15,5.46,5.46,5.67,5.77,5.88,5.93,5.93,5.93,5.93,5.93,6.08,6.08,6.08,6.08,6.08,6.08,6.08,6.08,6.08,6.18,6.18,6.18,6.18,6.18,6.18,6.18,6.18,6.18,6.18,6.18,6.18]
[8,0,0,0,0,0,0,0,0,0,0,0,0,0,0,0,0,0,0,0,0,0,0,0,0,0,0,0,0,0,0,0,0,0,0,0,0,0,0,0,0,0,0,0,0,0,0,0,0,2.96,3.02,3.08,3.15,3.21,3.27,3.33,3.39,3.47,3.54,3.76,3.82,3.92,3.97,4.07,4.12,4.2300000000000004,4.54,4.54,4.54,4.99,4.99,4.99,5.15,5.15,5.46,5.46,5.67,5.77,5.88,5.93,5.93,5.93,5.93,5.93,6.08,6.08,6.08,6.08,6.08,6.08,6.08,6.08,6.08,6.18,6.18,6.18,6.18,6.18,6.18,6.18,6.18,6.18,6.18,6.18,6.18]
[9,0,0,0,0,0,0,0,0,0,0,0,0,0,0,0,0,0,0,0,0,0,0,0,0,0,0,0,0,0,0,0,0,0,0,0,0,0,0,0,0,0,0,0,0,0,0,0,0,2.96,3.02,3.08,3.15,3.21,3.27,3.33,3.39,3.47,3.54,3.76,3.82,3.92,3.97,4.07,4.12,4.2300000000000004,4.54,4.54,4.54,4.99,4.99,4.99,5.15,5.15,5.46,5.46,5.67,5.77,5.88,5.93,5.93,5.93,5.93,5.93,6.08,6.08,6.08,6.08,6.08,6.08,6.08,6.08,6.08,6.18,6.18,6.18,6.18,6.18,6.18,6.18,6.18,6.18,6.18,6.18,6.18]
[10,0,0,0,0,0,0,0,0,0,0,0,0,0,0,0,0,0,0,0,0,0,0,0,0,0,0,0,0,0,0,0,0,0,0,0,0,0,0,0,0,0,0,0,0,0,0,0,0,2.96,3.02,3.08,3.15,3.21,3.27,3.33,3.39,3.47,3.54,3.76,3.82,3.92,3.97,4.07,4.12,4.2300000000000004,4.54,4.54,4.54,4.99,4.99,4.99,5.15,5.15,5.46,5.46,5.67,5.77,5.88,5.93,5.93,5.93,5.93,5.93,6.08,6.08,6.08,6.08,6.08,6.08,6.08,6.08,6.08,6.18,6.18,6.18,6.18,6.18,6.18,6.18,6.18,6.18,6.18,6.18,6.18]
[11,0,0,0,0,0,0,0,0,0,0,0,0,0,0,0,0,0,0,0,0,0,0,0,0,0,0,0,0,0,0,0,0,0,0,0,0,0,0,0,0,0,0,0,0,0,0,0,0,2.96,3.02,3.08,3.15,3.21,3.27,3.33,3.39,3.47,3.54,3.76,3.82,3.92,3.97,4.07,4.12,4.2300000000000004,4.54,4.54,4.54,4.99,4.99,4.99,5.15,5.15,5.46,5.46,5.67,5.77,5.88,5.93,5.93,5.93,5.93,5.93,6.08,6.08,6.08,6.08,6.08,6.08,6.08,6.08,6.08,6.18,6.18,6.18,6.18,6.18,6.18,6.18,6.18,6.18,6.18,6.18,6.18]
[12,0,0,0,0,0,0,0,0,0,0,0,0,0,0,0,0,0,0,0,0,0,0,0,0,0,0,0,0,0,0,0,0,0,0,0,0,0,0,0,0,0,0,0,0,0,0,0,0,2.96,3.02,3.08,3.15,3.21,3.27,3.33,3.39,3.47,3.54,3.76,3.82,3.92,3.97,4.07,4.12,4.2300000000000004,4.54,4.54,4.54,4.99,4.99,4.99,5.15,5.15,5.46,5.46,5.67,5.77,5.88,5.93,5.93,5.93,5.93,5.93,6.08,6.08,6.08,6.08,6.08,6.08,6.08,6.08,6.08,6.18,6.18,6.18,6.18,6.18,6.18,6.18,6.18,6.18,6.18,6.18,6.18]
[13,0,0,0,0,0,0,0,0,0,0,0,0,0,0,0,0,0,0,0,0,0,0,0,0,0,0,0,0,0,0,0,0,0,0,0,0,0,0,0,0,0,0,0,0,0,0,0,0,2.96,3.02,3.08,3.15,3.21,3.27,3.33,3.39,3.47,3.54,3.76,3.82,3.92,3.97,4.07,4.12,4.2300000000000004,4.54,4.54,4.54,4.99,4.99,4.99,5.15,5.15,5.46,5.46,5.67,5.77,5.88,5.93,5.93,5.93,5.93,5.93,6.08,6.08,6.08,6.08,6.08,6.08,6.08,6.08,6.08,6.18,6.18,6.18,6.18,6.18,6.18,6.18,6.18,6.18,6.18,6.18,6.18]
[14,0,0,0,0,0,0,0,0,0,0,0,0,0,0,0,0,0,0,0,0,0,0,0,0,0,0,0,0,0,0,0,0,0,0,0,0,0,0,0,0,0,0,0,0,0,0,0,0,2.96,3.02,3.08,3.15,3.21,3.27,3.33,3.39,3.47,3.54,3.76,3.82,3.92,3.97,4.07,4.12,4.2300000000000004,4.54,4.54,4.54,4.99,4.99,4.99,5.15,5.15,5.46,5.46,5.67,5.77,5.88,5.93,5.93,5.93,5.93,5.93,6.08,6.08,6.08,6.08,6.08,6.08,6.08,6.08,6.08,6.18,6.18,6.18,6.18,6.18,6.18,6.18,6.18,6.18,6.18,6.18,6.18]
[15,0,0,0,0,0,0,0,0,0,0,0,0,0,0,0,0,0,0,0,0,0,0,0,0,0,0,0,0,0,0,0,0,0,0,0,0,0,0,0,0,0,0,0,0,0,0,0,0,2.96,3.02,3.08,3.15,3.21,3.27,3.33,3.39,3.47,3.54,3.76,3.82,3.92,3.97,4.07,4.12,4.2300000000000004,4.54,4.54,4.54,4.99,4.99,4.99,5.15,5.15,5.46,5.46,5.67,5.77,5.88,5.93,5.93,5.93,5.93,5.93,6.08,6.08,6.08,6.08,6.08,6.08,6.08,6.08,6.08,6.18,6.18,6.18,6.18,6.18,6.18,6.18,6.18,6.18,6.18,6.18,6.18]
[16,0,0,0,0,0,0,0,0,0,0,0,0,0,0,0,0,0,0,0,0,0,0,0,0,0,0,0,0,0,0,0,0,0,0,0,0,0,0,0,0,0,0,0,0,0,0,0,0,2.96,3.02,3.08,3.15,3.21,3.27,3.33,3.39,3.47,3.54,3.76,3.82,3.92,3.97,4.07,4.12,4.2300000000000004,4.54,4.54,4.54,4.99,4.99,4.99,5.15,5.15,5.46,5.46,5.67,5.77,5.88,5.93,5.93,5.93,5.93,5.93,6.08,6.08,6.08,6.08,6.08,6.08,6.08,6.08,6.08,6.18,6.18,6.18,6.18,6.18,6.18,6.18,6.18,6.18,6.18,6.18,6.18]
[17,0,0,0,0,0,0,0,0,0,0,0,0,0,0,0,0,0,0,0,0,0,0,0,0,0,0,0,0,0,0,0,0,0,0,0,0,0,0,0,0,0,0,0,0,0,0,0,0,2.96,3.02,3.08,3.15,3.21,3.27,3.33,3.39,3.47,3.54,3.76,3.82,3.92,3.97,4.07,4.12,4.2300000000000004,4.54,4.54,4.54,4.99,4.99,4.99,5.15,5.15,5.46,5.46,5.67,5.77,5.88,5.93,5.93,5.93,5.93,5.93,6.08,6.08,6.08,6.08,6.08,6.08,6.08,6.08,6.08,6.18,6.18,6.18,6.18,6.18,6.18,6.18,6.18,6.18,6.18,6.18,6.18]
[18,0,0,0,0,0,0,0,0,0,0,0,0,0,0,0,0,0,0,0,0,0,0,0,0,0,0,0,0,0,0,0,0,0,0,0,0,0,0,0,0,0,0,0,0,0,0,0,0,2.96,3.02,3.08,3.15,3.21,3.27,3.33,3.39,3.47,3.54,3.76,3.82,3.92,3.97,4.07,4.12,4.2300000000000004,4.54,4.54,4.54,4.99,4.99,4.99,5.15,5.15,5.46,5.46,5.67,5.77,5.88,5.93,5.93,5.93,5.93,5.93,6.08,6.08,6.08,6.08,6.08,6.08,6.08,6.08,6.08,6.18,6.18,6.18,6.18,6.18,6.18,6.18,6.18,6.18,6.18,6.18,6.18]
[19,0,0,0,0,0,0,0,0,0,0,0,0,0,0,0,0,0,0,0,0,0,0,0,0,0,0,0,0,0,0,0,0,0,0,0,0,0,0,0,0,0,0,0,0,0,0,0,0,2.96,3.02,3.08,3.15,3.21,3.27,3.33,3.39,3.47,3.54,3.76,3.82,3.92,3.97,4.07,4.12,4.2300000000000004,4.54,4.54,4.54,4.99,4.99,4.99,5.15,5.15,5.46,5.46,5.67,5.77,5.88,5.93,5.93,5.93,5.93,5.93,6.08,6.08,6.08,6.08,6.08,6.08,6.08,6.08,6.08,6.18,6.18,6.18,6.18,6.18,6.18,6.18,6.18,6.18,6.18,6.18,6.18]
[20,0,0,0,0,0,0,0,0,0,0,0,0,0,0,0,0,0,0,0,0,0,0,0,0,0,0,0,0,0,0,0,0,0,0,0,0,0,0,0,0,0,0,0,0,0,0,0,0,2.96,3.02,3.08,3.15,3.21,3.27,3.33,3.39,3.47,3.54,3.76,3.82,3.92,3.97,4.07,4.12,4.2300000000000004,4.54,4.54,4.54,4.99,4.99,4.99,5.15,5.15,5.46,5.46,5.67,5.77,5.88,5.93,5.93,5.93,5.93,5.93,6.08,6.08,6.08,6.08,6.08,6.08,6.08,6.08,6.08,6.18,6.18,6.18,6.18,6.18,6.18,6.18,6.18,6.18,6.18,6.18,6.18]
[21,0,0,0,0,0,0,0,0,0,0,0,0,0,0,0,0,0,0,0,0,0,0,0,0,0,0,0,0,0,0,0,0,0,0,0,0,0,0,0,0,0,0,0,0,0,0,0,0,2.96,3.02,3.08,3.15,3.21,3.27,3.33,3.39,3.47,3.54,3.76,3.82,3.92,3.97,4.07,4.12,4.2300000000000004,4.54,4.54,4.54,4.99,4.99,4.99,5.15,5.15,5.46,5.46,5.67,5.77,5.88,5.93,5.93,5.93,5.93,5.93,6.08,6.08,6.08,6.08,6.08,6.08,6.08,6.08,6.08,6.18,6.18,6.18,6.18,6.18,6.18,6.18,6.18,6.18,6.18,6.18,6.18]
[22,0,0,0,0,0,0,0,0,0,0,0,0,0,0,0,0,0,0,0,0,0,0,0,0,0,0,0,0,0,0,0,0,0,0,0,0,0,0,0,0,0,0,0,0,0,0,0,0,2.96,3.02,3.08,3.15,3.21,3.27,3.33,3.39,3.47,3.54,3.76,3.82,3.92,3.97,4.07,4.12,4.2300000000000004,4.54,4.54,4.54,4.99,4.99,4.99,5.15,5.15,5.46,5.46,5.67,5.77,5.88,5.93,5.93,5.93,5.93,5.93,6.08,6.08,6.08,6.08,6.08,6.08,6.08,6.08,6.08,6.18,6.18,6.18,6.18,6.18,6.18,6.18,6.18,6.18,6.18,6.18,6.18]
[23,0,0,0,0,0,0,0,0,0,0,0,0,0,0,0,0,0,0,0,0,0,0,0,0,0,0,0,0,0,0,0,0,0,0,0,0,0,0,0,0,0,0,0,0,0,0,0,0,2.96,3.02,3.08,3.15,3.21,3.27,3.33,3.39,3.47,3.54,3.76,3.82,3.92,3.97,4.07,4.12,4.2300000000000004,4.54,4.54,4.54,4.99,4.99,4.99,5.15,5.15,5.46,5.46,5.67,5.77,5.88,5.93,5.93,5.93,5.93,5.93,6.08,6.08,6.08,6.08,6.08,6.08,6.08,6.08,6.08,6.18,6.18,6.18,6.18,6.18,6.18,6.18,6.18,6.18,6.18,6.18,6.18]
[24,0,0,0,0,0,0,0,0,0,0,0,0,0,0,0,0,0,0,0,0,0,0,0,0,0,0,0,0,0,0,0,0,0,0,0,0,0,0,0,0,0,0,0,0,0,0,0,0,2.96,3.02,3.08,3.15,3.21,3.27,3.33,3.39,3.47,3.54,3.76,3.82,3.92,3.97,4.07,4.12,4.2300000000000004,4.54,4.54,4.54,4.99,4.99,4.99,5.15,5.15,5.46,5.46,5.67,5.77,5.88,5.93,5.93,5.93,5.93,5.93,6.08,6.08,6.08,6.08,6.08,6.08,6.08,6.08,6.08,6.18,6.18,6.18,6.18,6.18,6.18,6.18,6.18,6.18,6.18,6.18,6.18]
[25,0,0,0,0,0,0,0,0,0,0,0,0,0,0,0,0,0,0,0,0,0,0,0,0,0,0,0,0,0,0,0,0,0,0,0,0,0,0,0,0,0,0,0,0,0,0,0,0,2.96,3.02,3.08,3.15,3.21,3.27,3.33,3.39,3.47,3.54,3.76,3.82,3.92,3.97,4.07,4.12,4.2300000000000004,4.54,4.54,4.54,4.99,4.99,4.99,5.15,5.15,5.46,5.46,5.67,5.77,5.88,5.93,5.93,5.93,5.93,5.93,6.08,6.08,6.08,6.08,6.08,6.08,6.08,6.08,6.08,6.18,6.18,6.18,6.18,6.18,6.18,6.18,6.18,6.18,6.18,6.18,6.18]
[26,0,0,0,0,0,0,0,0,0,0,0,0,0,0,0,0,0,0,0,0,0,0,0,0,0,0,0,0,0,0,0,0,0,0,0,0,0,0,0,0,0,0,0,0,0,0,0,0,2.96,3.02,3.08,3.15,3.21,3.27,3.33,3.39,3.47,3.54,3.76,3.82,3.92,3.97,4.07,4.12,4.2300000000000004,4.54,4.54,4.54,4.99,4.99,4.99,5.15,5.15,5.46,5.46,5.67,5.77,5.88,5.93,5.93,5.93,5.93,5.93,6.08,6.08,6.08,6.08,6.08,6.08,6.08,6.08,6.08,6.18,6.18,6.18,6.18,6.18,6.18,6.18,6.18,6.18,6.18,6.18,6.18]
[27,0,0,0,0,0,0,0,0,0,0,0,0,0,0,0,0,0,0,0,0,0,0,0,0,0,0,0,0,0,0,0,0,0,0,0,0,0,0,0,0,0,0,0,0,0,0,0,0,2.96,3.02,3.08,3.15,3.21,3.27,3.33,3.39,3.47,3.54,3.76,3.82,3.92,3.97,4.07,4.12,4.2300000000000004,4.54,4.54,4.54,4.99,4.99,4.99,5.15,5.15,5.46,5.46,5.67,5.77,5.88,5.93,5.93,5.93,5.93,5.93,6.08,6.08,6.08,6.08,6.08,6.08,6.08,6.08,6.08,6.18,6.18,6.18,6.18,6.18,6.18,6.18,6.18,6.18,6.18,6.18,6.18]
[28,0,0,0,0,0,0,0,0,0,0,0,0,0,0,0,0,0,0,0,0,0,0,0,0,0,0,0,0,0,0,0,0,0,0,0,0,0,0,0,0,0,0,0,0,0,0,0,0,2.96,3.02,3.08,3.15,3.21,3.27,3.33,3.39,3.47,3.54,3.76,3.82,3.92,3.97,4.07,4.12,4.2300000000000004,4.54,4.54,4.54,4.99,4.99,4.99,5.15,5.15,5.46,5.46,5.67,5.77,5.88,5.93,5.93,5.93,5.93,5.93,6.08,6.08,6.08,6.08,6.08,6.08,6.08,6.08,6.08,6.18,6.18,6.18,6.18,6.18,6.18,6.18,6.18,6.18,6.18,6.18,6.18]
[29,0,0,0,0,0,0,0,0,0,0,0,0,0,0,0,0,0,0,0,0,0,0,0,0,0,0,0,0,0,0,0,0,0,0,0,0,0,0,0,0,0,0,0,0,0,0,0,0,2.96,3.02,3.08,3.15,3.21,3.27,3.33,3.39,3.47,3.54,3.76,3.82,3.92,3.97,4.07,4.12,4.2300000000000004,4.54,4.54,4.54,4.99,4.99,4.99,5.15,5.15,5.46,5.46,5.67,5.77,5.88,5.93,5.93,5.93,5.93,5.93,6.08,6.08,6.08,6.08,6.08,6.08,6.08,6.08,6.08,6.18,6.18,6.18,6.18,6.18,6.18,6.18,6.18,6.18,6.18,6.18,6.18]
[30,0,0,0,0,0,0,0,0,0,0,0,0,0,0,0,0,0,0,0,0,0,0,0,0,0,0,0,0,0,0,0,0,0,0,0,0,0,0,0,0,0,0,0,0,0,0,0,0,2.96,3.02,3.08,3.15,3.21,3.27,3.33,3.39,3.47,3.54,3.76,3.82,3.92,3.97,4.07,4.12,4.2300000000000004,4.54,4.54,4.54,4.99,4.99,4.99,5.15,5.15,5.46,5.46,5.67,5.77,5.88,5.93,5.93,5.93,5.93,5.93,6.08,6.08,6.08,6.08,6.08,6.08,6.08,6.08,6.08,6.18,6.18,6.18,6.18,6.18,6.18,6.18,6.18,6.18,6.18,6.18,6.18]
[31,0,0,0,0,0,0,0,0,0,0,0,0,0,0,0,0,0,0,0,0,0,0,0,0,0,0,0,0,0,0,0,0,0,0,0,0,0,0,0,0,0,0,0,0,0,0,0,0,2.96,3.02,3.08,3.15,3.21,3.27,3.33,3.39,3.47,3.54,3.76,3.82,3.92,3.97,4.07,4.12,4.2300000000000004,4.54,4.54,4.54,4.99,4.99,4.99,5.15,5.15,5.46,5.46,5.67,5.77,5.88,5.93,5.93,5.93,5.93,5.93,6.08,6.08,6.08,6.08,6.08,6.08,6.08,6.08,6.08,6.18,6.18,6.18,6.18,6.18,6.18,6.18,6.18,6.18,6.18,6.18,6.18]
[32,0,0,0,0,0,0,0,0,0,0,0,0,0,0,0,0,0,0,0,0,0,0,0,0,0,0,0,0,0,0,0,0,0,0,0,0,0,0,0,0,0,0,0,0,0,0,0,0,2.96,3.02,3.08,3.15,3.21,3.27,3.33,3.39,3.47,3.54,3.76,3.82,3.92,3.97,4.07,4.12,4.2300000000000004,4.54,4.54,4.54,4.99,4.99,4.99,5.15,5.15,5.46,5.46,5.67,5.77,5.88,5.93,5.93,5.93,5.93,5.93,6.08,6.08,6.08,6.08,6.08,6.08,6.08,6.08,6.08,6.18,6.18,6.18,6.18,6.18,6.18,6.18,6.18,6.18,6.18,6.18,6.18]
[33,0,0,0,0,0,0,0,0,0,0,0,0,0,0,0,0,0,0,0,0,0,0,0,0,0,0,0,0,0,0,0,0,0,0,0,0,0,0,0,0,0,0,0,0,0,0,0,0,2.96,3.02,3.08,3.15,3.21,3.27,3.33,3.39,3.47,3.54,3.76,3.82,3.92,3.97,4.07,4.12,4.2300000000000004,4.54,4.54,4.54,4.99,4.99,4.99,5.15,5.15,5.46,5.46,5.67,5.77,5.88,5.93,5.93,5.93,5.93,5.93,6.08,6.08,6.08,6.08,6.08,6.08,6.08,6.08,6.08,6.18,6.18,6.18,6.18,6.18,6.18,6.18,6.18,6.18,6.18,6.18,6.18]
[34,0,0,0,0,0,0,0,0,0,0,0,0,0,0,0,0,0,0,0,0,0,0,0,0,0,0,0,0,0,0,0,0,0,0,0,0,0,0,0,0,0,0,0,0,0,0,0,0,2.96,3.02,3.08,3.15,3.21,3.27,3.33,3.39,3.47,3.54,3.76,3.82,3.92,3.97,4.07,4.12,4.2300000000000004,4.54,4.54,4.54,4.99,4.99,4.99,5.15,5.15,5.46,5.46,5.67,5.77,5.88,5.93,5.93,5.93,5.93,5.93,6.08,6.08,6.08,6.08,6.08,6.08,6.08,6.08,6.08,6.18,6.18,6.18,6.18,6.18,6.18,6.18,6.18,6.18,6.18,6.18,6.18]
[35,0,0,0,0,0,0,0,0,0,0,0,0,0,0,0,0,0,0,0,0,0,0,0,0,0,0,0,0,0,0,0,0,0,0,0,0,0,0,0,0,0,0,0,0,0,0,0,0,2.96,3.02,3.08,3.15,3.21,3.27,3.33,3.39,3.47,3.54,3.76,3.82,3.92,3.97,4.07,4.12,4.2300000000000004,4.54,4.54,4.54,4.99,4.99,4.99,5.15,5.15,5.46,5.46,5.67,5.77,5.88,5.93,5.93,5.93,5.93,5.93,6.08,6.08,6.08,6.08,6.08,6.08,6.08,6.08,6.08,6.18,6.18,6.18,6.18,6.18,6.18,6.18,6.18,6.18,6.18,6.18,6.18]
[36,0,0,0,0,0,0,0,0,0,0,0,0,0,0,0,0,0,0,0,0,0,0,0,0,0,0,0,0,0,0,0,0,0,0,0,0,0,0,0,0,0,0,0,0,0,0,0,0,2.96,3.02,3.08,3.15,3.21,3.27,3.33,3.39,3.47,3.54,3.76,3.82,3.92,3.97,4.07,4.12,4.2300000000000004,4.54,4.54,4.54,4.99,4.99,4.99,5.15,5.15,5.46,5.46,5.67,5.77,5.88,5.93,5.93,5.93,5.93,5.93,6.08,6.08,6.08,6.08,6.08,6.08,6.08,6.08,6.08,6.18,6.18,6.18,6.18,6.18,6.18,6.18,6.18,6.18,6.18,6.18,6.18]
[37,0,0,0,0,0,0,0,0,0,0,0,0,0,0,0,0,0,0,0,0,0,0,0,0,0,0,0,0,0,0,0,0,0,0,0,0,0,0,0,0,0,0,0,0,0,0,0,0,2.96,3.02,3.08,3.15,3.21,3.27,3.33,3.39,3.47,3.54,3.76,3.82,3.92,3.97,4.07,4.12,4.2300000000000004,4.54,4.54,4.54,4.99,4.99,4.99,5.15,5.15,5.46,5.46,5.67,5.77,5.88,5.93,5.93,5.93,5.93,5.93,6.08,6.08,6.08,6.08,6.08,6.08,6.08,6.08,6.08,6.18,6.18,6.18,6.18,6.18,6.18,6.18,6.18,6.18,6.18,6.18,6.18]
[38,0,0,0,0,0,0,0,0,0,0,0,0,0,0,0,0,0,0,0,0,0,0,0,0,0,0,0,0,0,0,0,0,0,0,0,0,0,0,0,0,0,0,0,0,0,0,0,0,2.96,3.02,3.08,3.15,3.21,3.27,3.33,3.39,3.47,3.54,3.76,3.82,3.92,3.97,4.07,4.12,4.2300000000000004,4.54,4.54,4.54,4.99,4.99,4.99,5.15,5.15,5.46,5.46,5.67,5.77,5.88,5.93,5.93,5.93,5.93,5.93,6.08,6.08,6.08,6.08,6.08,6.08,6.08,6.08,6.08,6.18,6.18,6.18,6.18,6.18,6.18,6.18,6.18,6.18,6.18,6.18,6.18]
[39,0,0,0,0,0,0,0,0,0,0,0,0,0,0,0,0,0,0,0,0,0,0,0,0,0,0,0,0,0,0,0,0,0,0,0,0,0,0,0,0,0,0,0,0,0,0,0,0,2.96,3.02,3.08,3.15,3.21,3.27,3.33,3.39,3.47,3.54,3.76,3.82,3.92,3.97,4.07,4.12,4.2300000000000004,4.54,4.54,4.54,4.99,4.99,4.99,5.15,5.15,5.46,5.46,5.67,5.77,5.88,5.93,5.93,5.93,5.93,5.93,6.08,6.08,6.08,6.08,6.08,6.08,6.08,6.08,6.08,6.18,6.18,6.18,6.18,6.18,6.18,6.18,6.18,6.18,6.18,6.18,6.18]
[40,0,0,0,0,0,0,0,0,0,0,0,0,0,0,0,0,0,0,0,0,0,0,0,0,0,0,0,0,0,0,0,0,0,0,0,0,0,0,0,0,0,0,0,0,0,0,0,0,2.96,3.02,3.08,3.15,3.21,3.27,3.33,3.39,3.47,3.54,3.76,3.82,3.92,3.97,4.07,4.12,4.2300000000000004,4.54,4.54,4.54,4.99,4.99,4.99,5.15,5.15,5.46,5.46,5.67,5.77,5.88,5.93,5.93,5.93,5.93,5.93,6.08,6.08,6.08,6.08,6.08,6.08,6.08,6.08,6.08,6.18,6.18,6.18,6.18,6.18,6.18,6.18,6.18,6.18,6.18,6.18,6.18]
[41,0,0,0,0,0,0,0,0,0,0,0,0,0,0,0,0,0,0,0,0,0,0,0,0,0,0,0,0,0,0,0,0,0,0,0,0,0,0,0,0,0,0,0,0,0,0,0,0,2.99,3.02,3.08,3.15,3.21,3.27,3.33,3.39,3.47,3.54,3.76,3.82,3.92,3.97,4.07,4.12,4.2300000000000004,4.54,4.54,4.54,4.99,4.99,4.99,5.15,5.15,5.46,5.46,5.67,5.77,5.88,5.93,5.93,5.93,5.93,5.93,6.08,6.08,6.08,6.08,6.08,6.08,6.08,6.08,6.08,6.18,6.18,6.18,6.18,6.18,6.18,6.18,6.18,6.18,6.18,6.18,6.18]
[42,0,0,0,0,0,0,0,0,0,0,0,0,0,0,0,0,0,0,0,0,0,0,0,0,0,0,0,0,0,0,0,0,0,0,0,0,0,0,0,0,0,0,0,0,0,0,0,0,3.02,3.05,3.08,3.15,3.21,3.27,3.33,3.39,3.47,3.54,3.76,3.82,3.92,3.97,4.07,4.12,4.2300000000000004,4.54,4.54,4.54,4.99,4.99,4.99,5.15,5.15,5.46,5.46,5.67,5.77,5.88,5.93,5.93,5.93,5.93,5.93,6.08,6.08,6.08,6.08,6.08,6.08,6.08,6.08,6.08,6.18,6.18,6.18,6.18,6.18,6.18,6.18,6.18,6.18,6.18,6.18,6.18]
[43,0,0,0,0,0,0,0,0,0,0,0,0,0,0,0,0,0,0,0,0,0,0,0,0,0,0,0,0,0,0,0,0,0,0,0,0,0,0,0,0,0,0,0,0,0,0,0,0,3.07,3.08,3.12,3.15,3.21,3.27,3.33,3.39,3.47,3.54,3.76,3.82,3.92,3.97,4.07,4.12,4.2300000000000004,4.54,4.54,4.54,4.99,4.99,4.99,5.15,5.15,5.46,5.46,5.67,5.77,5.88,5.93,5.93,5.93,5.93,5.93,6.08,6.08,6.08,6.08,6.08,6.08,6.08,6.08,6.08,6.18,6.18,6.18,6.18,6.18,6.18,6.18,6.18,6.18,6.18,6.18,6.18]
[44,0,0,0,0,0,0,0,0,0,0,0,0,0,0,0,0,0,0,0,0,0,0,0,0,0,0,0,0,0,0,0,0,0,0,0,0,0,0,0,0,0,0,0,0,0,0,0,0,3.11,3.13,3.15,3.18,3.21,3.27,3.33,3.39,3.47,3.54,3.76,3.82,3.92,3.97,4.07,4.12,4.2300000000000004,4.54,4.54,4.54,4.99,4.99,4.99,5.15,5.15,5.46,5.46,5.67,5.77,5.88,5.93,5.93,5.93,5.93,5.93,6.08,6.08,6.08,6.08,6.08,6.08,6.08,6.08,6.08,6.18,6.18,6.18,6.18,6.18,6.18,6.18,6.18,6.18,6.18,6.18,6.18]
[45,0,0,0,0,0,0,0,0,0,0,0,0,0,0,0,0,0,0,0,0,0,0,0,0,0,0,0,0,0,0,0,0,0,0,0,0,0,0,0,0,0,0,0,0,0,0,0,0,3.14,3.16,3.18,3.21,3.24,3.27,3.33,3.39,3.47,3.54,3.76,3.82,3.92,3.97,4.07,4.12,4.2300000000000004,4.54,4.54,4.54,4.99,4.99,4.99,5.15,5.15,5.46,5.46,5.67,5.77,5.88,5.93,5.93,5.93,5.93,5.93,6.08,6.08,6.08,6.08,6.08,6.08,6.08,6.08,6.08,6.18,6.18,6.18,6.18,6.18,6.18,6.18,6.18,6.18,6.18,6.18,6.18]
[46,0,0,0,0,0,0,0,0,0,0,0,0,0,0,0,0,0,0,0,0,0,0,0,0,0,0,0,0,0,0,0,0,0,0,0,0,0,0,0,0,0,0,0,0,0,0,0,0,3.18,3.19,3.21,3.23,3.27,3.3,3.33,3.39,3.47,3.54,3.76,3.82,3.92,3.97,4.07,4.12,4.2300000000000004,4.54,4.54,4.54,4.99,4.99,4.99,5.15,5.15,5.46,5.46,5.67,5.77,5.88,5.93,5.93,5.93,5.93,5.93,6.08,6.08,6.08,6.08,6.08,6.08,6.08,6.08,6.08,6.18,6.18,6.18,6.18,6.18,6.18,6.18,6.18,6.18,6.18,6.18,6.18]
[47,0,0,0,0,0,0,0,0,0,0,0,0,0,0,0,0,0,0,0,0,0,0,0,0,0,0,0,0,0,0,0,0,0,0,0,0,0,0,0,0,0,0,0,0,0,0,0,0,3.21,3.22,3.24,3.26,3.29,3.32,3.36,3.39,3.47,3.54,3.76,3.82,3.92,3.97,4.07,4.12,4.2300000000000004,4.54,4.54,4.54,4.99,4.99,4.99,5.15,5.15,5.46,5.46,5.67,5.77,5.88,5.93,5.93,5.93,5.93,5.93,6.08,6.08,6.08,6.08,6.08,6.08,6.08,6.08,6.08,6.18,6.18,6.18,6.18,6.18,6.18,6.18,6.18,6.18,6.18,6.18,6.18]
[48,0,0,0,0,0,0,0,0,0,0,0,0,0,0,0,0,0,0,0,0,0,0,0,0,0,0,0,0,0,0,0,0,0,0,0,0,0,0,0,0,0,0,0,0,0,0,0,0,3.25,3.54,3.27,3.29,3.31,3.34,3.38,3.42,3.47,3.54,3.76,3.82,3.92,3.97,4.07,4.12,4.2300000000000004,4.54,4.54,4.54,4.99,4.99,4.99,5.15,5.15,5.46,5.46,5.67,5.77,5.88,5.93,5.93,5.93,5.93,5.93,6.08,6.08,6.08,6.08,6.08,6.08,6.08,6.08,6.08,6.18,6.18,6.18,6.18,6.18,6.18,6.18,6.18,6.18,6.18,6.18,6.18]
[49,0,0,0,0,0,0,0,0,0,0,0,0,0,0,0,0,0,0,0,0,0,0,0,0,0,0,0,0,0,0,0,0,0,0,0,0,0,0,0,0,0,0,0,0,0,0,0,0,3.27,3.28,3.53,3.32,3.34,3.37,3.4,3.45,3.49,3.54,3.76,3.82,3.92,3.97,4.07,4.12,4.2300000000000004,4.54,4.54,4.54,4.99,4.99,4.99,5.15,5.15,5.46,5.46,5.67,5.77,5.88,5.93,5.93,5.93,5.93,5.93,6.08,6.08,6.08,6.08,6.08,6.08,6.08,6.08,6.08,6.18,6.18,6.18,6.18,6.18,6.18,6.18,6.18,6.18,6.18,6.18,6.18]
[50,0,0,0,0,0,0,0,0,0,0,0,0,0,0,0,0,0,0,0,0,0,0,0,0,0,0,0,0,0,0,0,0,0,0,0,0,0,0,0,0,0,0,0,0,0,0,0,0,3.32,3.32,3.33,3.57,3.37,3.39,3.42,3.46,3.51,3.56,3.76,3.82,3.92,3.97,4.07,4.12,4.2300000000000004,4.54,4.54,4.54,4.99,4.99,4.99,5.15,5.15,5.46,5.46,5.67,5.77,5.88,5.93,5.93,5.93,5.93,5.93,6.08,6.08,6.08,6.08,6.08,6.08,6.08,6.08,6.08,6.18,6.18,6.18,6.18,6.18,6.18,6.18,6.18,6.18,6.18,6.18,6.18]
[51,0,0,0,0,0,0,0,0,0,0,0,0,0,0,0,0,0,0,0,0,0,0,0,0,0,0,0,0,0,0,0,0,0,0,0,0,0,0,0,0,0,0,0,0,0,0,0,0,0,3.37,3.37,3.38,3.62,3.42,3.43,3.48,3.52,3.57,3.76,3.82,3.92,3.97,4.07,4.12,4.2300000000000004,4.54,4.54,4.54,4.99,4.99,4.99,5.15,5.15,5.46,5.46,5.67,5.77,5.88,5.93,5.93,5.93,5.93,5.93,6.08,6.08,6.08,6.08,6.08,6.08,6.08,6.08,6.08,6.18,6.18,6.18,6.18,6.18,6.18,6.18,6.18,6.18,6.18,6.18,6.18]
[52,0,0,0,0,0,0,0,0,0,0,0,0,0,0,0,0,0,0,0,0,0,0,0,0,0,0,0,0,0,0,0,0,0,0,0,0,0,0,0,0,0,0,0,0,0,0,0,0,0,0,3.42,3.42,3.43,3.68,3.48,3.49,3.53,3.58,3.76,4.05,4.08,4.08,4.08,4.12,4.2300000000000004,4.54,4.54,4.54,4.99,4.99,4.99,5.15,5.15,5.46,5.46,5.67,5.77,5.88,5.93,5.93,5.93,5.93,5.93,6.08,6.08,6.08,6.08,6.08,6.08,6.08,6.08,6.08,6.18,6.18,6.18,6.18,6.18,6.18,6.18,6.18,6.18,6.18,6.18,6.18]
[53,0,0,0,0,0,0,0,0,0,0,0,0,0,0,0,0,0,0,0,0,0,0,0,0,0,0,0,0,0,0,0,0,0,0,0,0,0,0,0,0,0,0,0,0,0,0,0,0,0,0,0,3.48,3.48,3.49,3.72,3.53,3.54,3.59,3.76,3.82,4.05,4.08,4.08,4.12,4.2300000000000004,4.54,4.54,4.54,4.99,4.99,4.99,5.15,5.15,5.46,5.46,5.67,5.77,5.88,5.93,5.93,5.93,5.93,5.93,6.08,6.08,6.08,6.08,6.08,6.08,6.08,6.08,6.08,6.18,6.18,6.18,6.18,6.18,6.18,6.18,6.18,6.18,6.18,6.18,6.18]
[54,0,0,0,0,0,0,0,0,0,0,0,0,0,0,0,0,0,0,0,0,0,0,0,0,0,0,0,0,0,0,0,0,0,0,0,0,0,0,0,0,0,0,0,0,0,0,0,0,0,0,0,0,3.57,3.57,3.57,3.79,3.59,3.61,3.71,3.82,4.03,4.05,4.07,4.12,4.2300000000000004,4.54,4.54,4.54,4.99,4.99,4.99,5.15,5.15,5.46,5.46,5.67,5.77,5.88,5.93,5.93,5.93,5.93,5.93,6.08,6.08,6.08,6.08,6.08,6.08,6.08,6.08,6.08,6.18,6.18,6.18,6.18,6.18,6.18,6.18,6.18,6.18,6.18,6.18,6.18]
[55,0,0,0,0,0,0,0,0,0,0,0,0,0,0,0,0,0,0,0,0,0,0,0,0,0,0,0,0,0,0,0,0,0,0,0,0,0,0,0,0,0,0,0,0,0,0,0,0,0,0,0,0,0,3.61,3.61,3.62,3.83,3.66,3.71,3.76,4.0599999999999996,4.03,4.05,4.12,4.2300000000000004,4.54,4.54,4.54,4.99,4.99,4.99,5.15,5.15,5.46,5.46,5.67,5.77,5.88,5.93,5.93,5.93,5.93,5.93,6.08,6.08,6.08,6.08,6.08,6.08,6.08,6.08,6.08,6.18,6.18,6.18,6.18,6.18,6.18,6.18,6.18,6.18,6.18,6.18,6.18]
[56,0,0,0,0,0,0,0,0,0,0,0,0,0,0,0,0,0,0,0,0,0,0,0,0,0,0,0,0,0,0,0,0,0,0,0,0,0,0,0,0,0,0,0,0,0,0,0,0,0,0,0,0,0,0,3.63,3.64,3.66,3.87,4.3899999999999997,4.03,3.92,3.97,4.03,4.5,4.3899999999999997,4.54,4.54,4.54,4.99,4.99,4.99,5.15,5.15,5.46,5.46,5.67,5.77,5.88,5.93,5.93,5.93,5.93,5.93,6.08,6.08,6.08,6.08,6.08,6.08,6.08,6.08,6.08,6.18,6.18,6.18,6.18,6.18,6.18,6.18,6.18,6.18,6.18,6.18,6.18]
[57,0,0,0,0,0,0,0,0,0,0,0,0,0,0,0,0,0,0,0,0,0,0,0,0,0,0,0,0,0,0,0,0,0,0,0,0,0,0,0,0,0,0,0,0,0,0,0,0,0,0,0,0,0,0,0,3.95,4.05,4.2699999999999996,4.6100000000000003,4.4000000000000004,4.24,4.1900000000000004,4.2300000000000004,4.4800000000000004,4.5,4.53,4.54,4.54,4.99,4.99,4.99,5.15,5.15,5.46,5.46,5.67,5.77,5.88,5.93,5.93,5.93,5.93,5.93,6.08,6.08,6.08,6.08,6.08,6.08,6.08,6.08,6.08,6.18,6.18,6.18,6.18,6.18,6.18,6.18,6.18,6.18,6.18,6.18,6.18]
[58,0,0,0,0,0,0,0,0,0,0,0,0,0,0,0,0,0,0,0,0,0,0,0,0,0,0,0,0,0,0,0,0,0,0,0,0,0,0,0,0,0,0,0,0,0,0,0,0,0,0,0,0,0,0,0,0,3.95,4.05,4.2699999999999996,4.6100000000000003,4.4000000000000004,4.26,4.28,4.4800000000000004,4.4800000000000004,4.5,4.53,4.54,4.99,4.99,4.99,5.15,5.15,5.46,5.46,5.67,5.77,5.88,5.93,5.93,5.93,5.93,5.93,6.08,6.08,6.08,6.08,6.08,6.08,6.08,6.08,6.08,6.18,6.18,6.18,6.18,6.18,6.18,6.18,6.18,6.18,6.18,6.18,6.18]
[59,0,0,0,0,0,0,0,0,0,0,0,0,0,0,0,0,0,0,0,0,0,0,0,0,0,0,0,0,0,0,0,0,0,0,0,0,0,0,0,0,0,0,0,0,0,0,0,0,0,0,0,0,0,0,0,0,0,3.95,4.05,4.2699999999999996,4.6100000000000003,4.4000000000000004,4.34,4.51,4.4800000000000004,4.4800000000000004,4.5,4.53,4.99,4.99,4.99,5.15,5.15,5.46,5.46,5.67,5.77,5.88,5.93,5.93,5.93,5.93,5.93,6.08,6.08,6.08,6.08,6.08,6.08,6.08,6.08,6.08,6.18,6.18,6.18,6.18,6.18,6.18,6.18,6.18,6.18,6.18,6.18,6.18]
[60,0,0,0,0,0,0,0,0,0,0,0,0,0,0,0,0,0,0,0,0,0,0,0,0,0,0,0,0,0,0,0,0,0,0,0,0,0,0,0,0,0,0,0,0,0,0,0,0,0,0,0,0,0,0,0,0,0,0,3.95,4.05,4.2699999999999996,4.6100000000000003,4.54,4.5599999999999996,4.51,4.49,4.4800000000000004,4.5,4.9800000000000004,4.9800000000000004,4.9800000000000004,5.15,5.15,5.46,5.46,5.67,5.77,5.88,5.93,5.93,5.93,5.93,5.93,6.08,6.08,6.08,6.08,6.08,6.08,6.08,6.08,6.08,6.18,6.18,6.18,6.18,6.18,6.18,6.18,6.18,6.18,6.18,6.18,6.18]
[61,0,0,0,0,0,0,0,0,0,0,0,0,0,0,0,0,0,0,0,0,0,0,0,0,0,0,0,0,0,0,0,0,0,0,0,0,0,0,0,0,0,0,0,0,0,0,0,0,0,0,0,0,0,0,0,0,0,0,0,3.95,4.05,4.2699999999999996,4.6100000000000003,4.72,4.5599999999999996,4.54,4.54,4.4800000000000004,4.95,4.9800000000000004,4.9800000000000004,4.9800000000000004,5.15,5.46,5.46,5.67,5.77,5.88,5.93,5.93,5.93,5.93,5.93,6.08,6.08,6.08,6.08,6.08,6.08,6.08,6.08,6.08,6.18,6.18,6.18,6.18,6.18,6.18,6.18,6.18,6.18,6.18,6.18,6.18]
[62,0,0,0,0,0,0,0,0,0,0,0,0,0,0,0,0,0,0,0,0,0,0,0,0,0,0,0,0,0,0,0,0,0,0,0,0,0,0,0,0,0,0,0,0,0,0,0,0,0,0,0,0,0,0,0,0,0,0,0,0,4.21,4.3099999999999996,4.54,4.99,4.7300000000000004,4.6100000000000003,4.57,4.53,4.93,4.95,4.9800000000000004,5.1100000000000003,5.1100000000000003,5.46,5.46,5.67,5.77,5.88,5.93,5.93,5.93,5.93,5.93,6.08,6.08,6.08,6.08,6.08,6.08,6.08,6.08,6.08,6.18,6.18,6.18,6.18,6.18,6.18,6.18,6.18,6.18,6.18,6.18,6.18]
[63,0,0,0,0,0,0,0,0,0,0,0,0,0,0,0,0,0,0,0,0,0,0,0,0,0,0,0,0,0,0,0,0,0,0,0,0,0,0,0,0,0,0,0,0,0,0,0,0,0,0,0,0,0,0,0,0,0,0,0,0,0,4.21,4.3099999999999996,4.54,4.99,4.83,4.6100000000000003,4.55,4.93,4.93,4.95,4.9800000000000004,5.1100000000000003,5.1100000000000003,5.46,5.67,5.77,5.88,5.93,5.93,5.93,5.93,5.93,6.08,6.08,6.08,6.08,6.08,6.08,6.08,6.08,6.08,6.18,6.18,6.18,6.18,6.18,6.18,6.18,6.18,6.18,6.18,6.18,6.18]
[64,0,0,0,0,0,0,0,0,0,0,0,0,0,0,0,0,0,0,0,0,0,0,0,0,0,0,0,0,0,0,0,0,0,0,0,0,0,0,0,0,0,0,0,0,0,0,0,0,0,0,0,0,0,0,0,0,0,0,0,0,0,0,4.21,4.3099999999999996,4.54,4.99,4.93,4.66,4.96,4.93,4.93,4.95,4.9800000000000004,5.26,5.26,5.67,5.77,5.88,5.93,5.93,5.93,5.93,5.93,6.08,6.08,6.08,6.08,6.08,6.08,6.08,6.08,6.08,6.18,6.18,6.18,6.18,6.18,6.18,6.18,6.18,6.18,6.18,6.18,6.18]
[65,0,0,0,0,0,0,0,0,0,0,0,0,0,0,0,0,0,0,0,0,0,0,0,0,0,0,0,0,0,0,0,0,0,0,0,0,0,0,0,0,0,0,0,0,0,0,0,0,0,0,0,0,0,0,0,0,0,0,0,0,0,0,0,4.22,4.32,4.55,4.99,5.0199999999999996,5.01,4.96,4.93,4.93,4.9400000000000004,5.44,5.44,5.44,5.77,5.88,5.93,5.93,5.93,5.93,5.93,6.08,6.08,6.08,6.08,6.08,6.08,6.08,6.08,6.08,6.18,6.18,6.18,6.18,6.18,6.18,6.18,6.18,6.18,6.18,6.18,6.18]
[66,0,0,0,0,0,0,0,0,0,0,0,0,0,0,0,0,0,0,0,0,0,0,0,0,0,0,0,0,0,0,0,0,0,0,0,0,0,0,0,0,0,0,0,0,0,0,0,0,0,0,0,0,0,0,0,0,0,0,0,0,0,0,0,0,4.5,4.58,4.74,5.03,5.15,5.01,4.9800000000000004,5,4.93,5.39,5.44,5.58,5.6,5.88,5.93,5.93,5.93,5.93,5.93,6.08,6.08,6.08,6.08,6.08,6.08,6.08,6.08,6.08,6.18,6.18,6.18,6.18,6.18,6.18,6.18,6.18,6.18,6.18,6.18,6.18]
[67,0,0,0,0,0,0,0,0,0,0,0,0,0,0,0,0,0,0,0,0,0,0,0,0,0,0,0,0,0,0,0,0,0,0,0,0,0,0,0,0,0,0,0,0,0,0,0,0,0,0,0,0,0,0,0,0,0,0,0,0,0,0,0,0,0,4.58,4.6900000000000004,4.9400000000000004,5.44,5.22,5.05,5.0199999999999996,4.99,5.37,5.39,5.44,5.58,5.8,5.93,5.93,5.93,5.93,5.93,6.08,6.08,6.08,6.08,6.08,6.08,6.08,6.08,6.08,6.18,6.18,6.18,6.18,6.18,6.18,6.18,6.18,6.18,6.18,6.18,6.18]
[{"$f":"A67+1","v":68},0,0,0,0,0,0,0,0,0,0,0,0,0,0,0,0,0,0,0,0,0,0,0,0,0,0,0,0,0,0,0,0,0,0,0,0,0,0,0,0,0,0,0,0,0,0,0,0,0,0,0,0,0,0,0,0,0,0,0,0,0,0,0,0,0,0,4.58,4.6900000000000004,4.9400000000000004,5.44,5.31,5.08,5.01,5.38,5.37,5.39,5.44,5.58,5.6,5.93,5.93,5.93,5.93,6.08,6.08,6.08,6.08,6.08,6.08,6.08,6.08,6.08,6.18,6.18,6.18,6.18,6.18,6.18,6.18,6.18,6.18,6.18,6.18,6.18]
[{"$f":"A68+1","v":69},0,0,0,0,0,0,0,0,0,0,0,0,0,0,0,0,0,0,0,0,0,0,0,0,0,0,0,0,0,0,0,0,0,0,0,0,0,0,0,0,0,0,0,0,0,0,0,0,0,0,0,0,0,0,0,0,0,0,0,0,0,0,0,0,0,0,0,4.58,4.6900000000000004,4.9400000000000004,5.44,5.41,5.1100000000000003,5.41,5.38,5.37,5.39,5.44,5.73,5.73,5.93,5.93,5.93,6.08,6.08,6.08,6.08,6.08,6.08,6.08,6.08,6.08,6.18,6.18,6.18,6.18,6.18,6.18,6.18,6.18,6.18,6.18,6.18,6.18]
[70,0,0,0,0,0,0,0,0,0,0,0,0,0,0,0,0,0,0,0,0,0,0,0,0,0,0,0,0,0,0,0,0,0,0,0,0,0,0,0,0,0,0,0,0,0,0,0,0,0,0,0,0,0,0,0,0,0,0,0,0,0,0,0,0,0,0,0,0,4.59,4.7,4.95,5.47,5.51,5.47,5.41,5.38,5.37,5.39,5.89,5.89,5.89,5.93,5.93,6.08,6.08,6.08,6.08,6.08,6.08,6.08,6.08,6.08,6.18,6.18,6.18,6.18,6.18,6.18,6.18,6.18,6.18,6.18,6.18,6.18]
[71,0,0,0,0,0,0,0,0,0,0,0,0,0,0,0,0,0,0,0,0,0,0,0,0,0,0,0,0,0,0,0,0,0,0,0,0,0,0,0,0,0,0,0,0,0,0,0,0,0,0,0,0,0,0,0,0,0,0,0,0,0,0,0,0,0,0,0,0,0,4.87,4.96,5.15,5.57,5.6,5.47,5.42,5.44,5.41,5.84,5.89,5.89,5.89,5.93,6.08,6.08,6.08,6.08,6.08,6.08,6.08,6.08,6.08,6.18,6.18,6.18,6.18,6.18,6.18,6.18,6.18,6.18,6.18,6.18,6.18]
[72,0,0,0,0,0,0,0,0,0,0,0,0,0,0,0,0,0,0,0,0,0,0,0,0,0,0,0,0,0,0,0,0,0,0,0,0,0,0,0,0,0,0,0,0,0,0,0,0,0,0,0,0,0,0,0,0,0,0,0,0,0,0,0,0,0,0,0,0,0,0,4.97,5.09,5.36,5.9,5.7,5.52,5.46,5.44,5.82,5.84,5.89,5.89,5.89,6.08,6.08,6.08,6.08,6.08,6.08,6.08,6.08,6.08,6.18,6.18,6.18,6.18,6.18,6.18,6.18,6.18,6.18,6.18,6.18,6.18]
[73,0,0,0,0,0,0,0,0,0,0,0,0,0,0,0,0,0,0,0,0,0,0,0,0,0,0,0,0,0,0,0,0,0,0,0,0,0,0,0,0,0,0,0,0,0,0,0,0,0,0,0,0,0,0,0,0,0,0,0,0,0,0,0,0,0,0,0,0,0,0,0,4.97,5.09,5.36,5.9,5.8,5.66,5.43,5.83,5.82,5.84,5.89,5.89,5.89,6.08,6.08,6.08,6.08,6.08,6.08,6.08,6.08,6.18,6.18,6.18,6.18,6.18,6.18,6.18,6.18,6.18,6.18,6.18,6.18]
[74,0,0,0,0,0,0,0,0,0,0,0,0,0,0,0,0,0,0,0,0,0,0,0,0,0,0,0,0,0,0,0,0,0,0,0,0,0,0,0,0,0,0,0,0,0,0,0,0,0,0,0,0,0,0,0,0,0,0,0,0,0,0,0,0,0,0,0,0,0,0,0,0,4.97,5.09,5.36,5.95,5.89,5.8,5.86,5.83,5.86,5.84,5.89,5.9,5.9,6.08,6.08,6.08,6.08,6.08,6.08,6.08,6.18,6.18,6.18,6.18,6.18,6.18,6.18,6.18,6.18,6.18,6.18,6.18]
[75,0,0,0,0,0,0,0,0,0,0,0,0,0,0,0,0,0,0,0,0,0,0,0,0,0,0,0,0,0,0,0,0,0,0,0,0,0,0,0,0,0,0,0,0,0,0,0,0,0,0,0,0,0,0,0,0,0,0,0,0,0,0,0,0,0,0,0,0,0,0,0,0,0,5.07,5.2,5.46,5.98,5.99,5.93,5.86,5.83,5.89,5.85,6.17,6.17,6.1,6.08,6.08,6.08,6.08,6.08,6.08,6.18,6.18,6.18,6.18,6.18,6.18,6.18,6.18,6.18,6.18,6.18,6.18]
[76,0,0,0,0,0,0,0,0,0,0,0,0,0,0,0,0,0,0,0,0,0,0,0,0,0,0,0,0,0,0,0,0,0,0,0,0,0,0,0,0,0,0,0,0,0,0,0,0,0,0,0,0,0,0,0,0,0,0,0,0,0,0,0,0,0,0,0,0,0,0,0,0,0,0,5.15,5.29,5.57,6.01,6.09,5.93,5.86,5.87,5.91,5.88,5.89,5.93,5.93,6.08,6.08,6.08,6.08,6.08,6.18,6.18,6.18,6.18,6.18,6.18,6.18,6.18,6.18,6.18,6.18,6.18]
[77,0,0,0,0,0,0,0,0,0,0,0,0,0,0,0,0,0,0,0,0,0,0,0,0,0,0,0,0,0,0,0,0,0,0,0,0,0,0,0,0,0,0,0,0,0,0,0,0,0,0,0,0,0,0,0,0,0,0,0,0,0,0,0,0,0,0,0,0,0,0,0,0,0,0,0,5.42,5.56,5.85,6.4,6.18,5.94,5.93,5.91,5.91,5.91,5.89,5.93,5.93,6.08,6.08,6.08,6.08,6.18,6.18,6.18,6.18,6.18,6.18,6.18,6.18,6.18,6.18,6.18,6.18]
[78,0,0,0,0,0,0,0,0,0,0,0,0,0,0,0,0,0,0,0,0,0,0,0,0,0,0,0,0,0,0,0,0,0,0,0,0,0,0,0,0,0,0,0,0,0,0,0,0,0,0,0,0,0,0,0,0,0,0,0,0,0,0,0,0,0,0,0,0,0,0,0,0,0,0,0,0,5.42,5.56,5.85,6.4,6.28,6.01,5.93,5.94,5.91,5.93,5.91,5.93,5.93,6.08,6.08,6.08,6.18,6.18,6.18,6.18,6.18,6.18,6.18,6.18,6.18,6.18,6.18,6.18]
[79,0,0,0,0,0,0,0,0,0,0,0,0,0,0,0,0,0,0,0,0,0,0,0,0,0,0,0,0,0,0,0,0,0,0,0,0,0,0,0,0,0,0,0,0,0,0,0,0,0,0,0,0,0,0,0,0,0,0,0,0,0,0,0,0,0,0,0,0,0,0,0,0,0,0,0,0,0,5.42,5.56,5.85,6.55,6.38,6.02,5.99,5.94,5.82,5.85,5.89,5.93,5.93,6.08,6.08,6.18,6.18,6.18,6.18,6.18,6.18,6.18,6.18,6.18,6.18,6.18,6.18]
[80,0,0,0,0,0,0,0,0,0,0,0,0,0,0,0,0,0,0,0,0,0,0,0,0,0,0,0,0,0,0,0,0,0,0,0,0,0,0,0,0,0,0,0,0,0,0,0,0,0,0,0,0,0,0,0,0,0,0,0,0,0,0,0,0,0,0,0,0,0,0,0,0,0,0,0,0,0,0,5.42,5.56,5.85,6.55,6.18,6.21,5.99,5.93,5.88,5.85,6.18,6.18,6.13,6.18,6.18,6.18,6.18,6.18,6.18,6.18,6.18,6.18,6.18,6.18,6.18,6.18]
[81,0,0,0,0,0,0,0,0,0,0,0,0,0,0,0,0,0,0,0,0,0,0,0,0,0,0,0,0,0,0,0,0,0,0,0,0,0,0,0,0,0,0,0,0,0,0,0,0,0,0,0,0,0,0,0,0,0,0,0,0,0,0,0,0,0,0,0,0,0,0,0,0,0,0,0,0,0,0,0,5.42,5.56,5.85,6.55,6.22,6.24,6.29,6.25,5.93,5.77,5.65,5.8,5.96,6.13,6.18,6.18,6.18,6.18,6.18,6.18,6.18,6.18,6.18,6.18,6.18]
[82,0,0,0,0,0,0,0,0,0,0,0,0,0,0,0,0,0,0,0,0,0,0,0,0,0,0,0,0,0,0,0,0,0,0,0,0,0,0,0,0,0,0,0,0,0,0,0,0,0,0,0,0,0,0,0,0,0,0,0,0,0,0,0,0,0,0,0,0,0,0,0,0,0,0,0,0,0,0,0,0,5.42,5.56,5.85,6.49,6.28,6.31,6.38,6.36,6.04,5.77,5.65,5.81,5.96,6.13,6.18,6.18,6.18,6.18,6.18,6.18,6.18,6.18,6.18,6.18]
[83,0,0,0,0,0,0,0,0,0,0,0,0,0,0,0,0,0,0,0,0,0,0,0,0,0,0,0,0,0,0,0,0,0,0,0,0,0,0,0,0,0,0,0,0,0,0,0,0,0,0,0,0,0,0,0,0,0,0,0,0,0,0,0,0,0,0,0,0,0,0,0,0,0,0,0,0,0,0,0,0,0,5.53,5.67,5.97,6.63,6.35,6.41,6.47,6.46,6.04,5.77,5.65,5.81,5.96,6.13,6.18,6.18,6.18,6.18,6.18,6.18,6.18,6.18,6.18]
[84,0,0,0,0,0,0,0,0,0,0,0,0,0,0,0,0,0,0,0,0,0,0,0,0,0,0,0,0,0,0,0,0,0,0,0,0,0,0,0,0,0,0,0,0,0,0,0,0,0,0,0,0,0,0,0,0,0,0,0,0,0,0,0,0,0,0,0,0,0,0,0,0,0,0,0,0,0,0,0,0,0,0,5.62,5.76,6.07,6.8,6.46,6.52,6.55,6.46,6.04,5.77,5.65,5.81,5.96,6.13,6.18,6.18,6.18,6.18,6.18,6.18,6.18,6.18]
[85,0,0,0,0,0,0,0,0,0,0,0,0,0,0,0,0,0,0,0,0,0,0,0,0,0,0,0,0,0,0,0,0,0,0,0,0,0,0,0,0,0,0,0,0,0,0,0,0,0,0,0,0,0,0,0,0,0,0,0,0,0,0,0,0,0,0,0,0,0,0,0,0,0,0,0,0,0,0,0,0,0,0,0,5.72,5.87,6.17,6.85,6.62,6.63,6.55,6.46,6.04,5.77,5.65,5.81,5.96,6.13,6.18,6.18,6.18,6.18,6.18,6.18,6.18]

{"sheet":"PIATodayJoint","index":11,"n_rows":85,"n_cols":105,"rows_kept":85,"cut":false,"hidden":true,"merged":[]}
[1,{"$f":"A1+1","v":2},{"$f":"B1+1","v":3},4,5,6,7,8,9,10,11,12,13,14,15,16,17,18,19,20,21,22,23,24,25,26,27,28,29,30,31,32,33,34,35,36,37,38,39,40,41,42,43,44,45,46,47,48,49,50,51,52,53,54,55,56,57,58,59,60,61,62,63,64,65,66,67,{"$f":"BO1+1","v":68},{"$f":"BP1+1","v":69},70,71,72,73,74,75,76,77,78,79,80,81,82,83,84,85,86,87,88,89,90,91,92,93,94,95,96,97,98,99,100,101,102,103,104,105]
[{"$f":"A1+1","v":2},0,0,0,0,0,0,0,0,0,0,0,0,0,0,0,0,0,0,0,0,0,0,0,0,0,0,0,0,0,0,0,0,0,0,0,0,0,0,0,0,0,0,0,0,0,0,0,0,2.89,2.94,2.98,3.03,3.09,3.13,3.18,3.23,3.27,3.48,3.87,3.87,3.87,3.87,3.87,4.2,4.2,4.2,4.2,4.28,4.63,4.63,4.76,4.8099999999999996,4.8099999999999996,5.05,5.05,5.05,5.17,5.22,5.6,5.6,5.68,5.68,5.73,5.98,6.13,6.13,6.13,6.13,6.13,6.13,6.13,6.13,6.13,6.13,6.13,6.13,6.13,6.13,6.13,6.13,6.13,6.13,6.13,6.13]
[{"$f":"A2+1","v":3},0,0,0,0,0,0,0,0,0,0,0,0,0,0,0,0,0,0,0,0,0,0,0,0,0,0,0,0,0,0,0,0,0,0,0,0,0,0,0,0,0,0,0,0,0,0,0,0,2.89,2.94,2.98,3.03,3.09,3.13,3.18,3.23,3.27,3.48,3.87,3.87,3.87,3.87,3.87,4.2,4.2,4.2,4.2,4.28,4.63,4.63,4.76,4.8099999999999996,4.8099999999999996,5.05,5.05,5.05,5.17,5.22,5.6,5.6,5.68,5.68,5.73,5.98,6.13,6.13,6.13,6.13,6.13,6.13,6.13,6.13,6.13,6.13,6.13,6.13,6.13,6.13,6.13,6.13,6.13,6.13,6.13,6.13]
[4,0,0,0,0,0,0,0,0,0,0,0,0,0,0,0,0,0,0,0,0,0,0,0,0,0,0,0,0,0,0,0,0,0,0,0,0,0,0,0,0,0,0,0,0,0,0,0,0,2.89,2.94,2.98,3.03,3.09,3.13,3.18,3.23,3.27,3.48,3.87,3.87,3.87,3.87,3.87,4.2,4.2,4.2,4.2,4.28,4.63,4.63,4.76,4.8099999999999996,4.8099999999999996,5.05,5.05,5.05,5.17,5.22,5.6,5.6,5.68,5.68,5.73,5.98,6.13,6.13,6.13,6.13,6.13,6.13,6.13,6.13,6.13,6.13,6.13,6.13,6.13,6.13,6.13,6.13,6.13,6.13,6.13,6.13]
[5,0,0,0,0,0,0,0,0,0,0,0,0,0,0,0,0,0,0,0,0,0,0,0,0,0,0,0,0,0,0,0,0,0,0,0,0,0,0,0,0,0,0,0,0,0,0,0,0,2.89,2.94,2.98,3.03,3.09,3.13,3.18,3.23,3.27,3.48,3.87,3.87,3.87,3.87,3.87,4.2,4.2,4.2,4.2,4.28,4.63,4.63,4.76,4.8099999999999996,4.8099999999999996,5.05,5.05,5.05,5.17,5.22,5.6,5.6,5.68,5.68,5.73,5.98,6.13,6.13,6.13,6.13,6.13,6.13,6.13,6.13,6.13,6.13,6.13,6.13,6.13,6.13,6.13,6.13,6.13,6.13,6.13,6.13]
[6,0,0,0,0,0,0,0,0,0,0,0,0,0,0,0,0,0,0,0,0,0,0,0,0,0,0,0,0,0,0,0,0,0,0,0,0,0,0,0,0,0,0,0,0,0,0,0,0,2.89,2.94,2.98,3.03,3.09,3.13,3.18,3.23,3.27,3.48,3.87,3.87,3.87,3.87,3.87,4.2,4.2,4.2,4.2,4.28,4.63,4.63,4.76,4.8099999999999996,4.8099999999999996,5.05,5.05,5.05,5.17,5.22,5.6,5.6,5.68,5.68,5.73,5.98,6.13,6.13,6.13,6.13,6.13,6.13,6.13,6.13,6.13,6.13,6.13,6.13,6.13,6.13,6.13,6.13,6.13,6.13,6.13,6.13]
[7,0,0,0,0,0,0,0,0,0,0,0,0,0,0,0,0,0,0,0,0,0,0,0,0,0,0,0,0,0,0,0,0,0,0,0,0,0,0,0,0,0,0,0,0,0,0,0,0,2.89,2.94,2.98,3.03,3.09,3.13,3.18,3.23,3.27,3.48,3.87,3.87,3.87,3.87,3.87,4.2,4.2,4.2,4.2,4.28,4.63,4.63,4.76,4.8099999999999996,4.8099999999999996,5.05,5.05,5.05,5.17,5.22,5.6,5.6,5.68,5.68,5.73,5.98,6.13,6.13,6.13,6.13,6.13,6.13,6.13,6.13,6.13,6.13,6.13,6.13,6.13,6.13,6.13,6.13,6.13,6.13,6.13,6.13]
[8,0,0,0,0,0,0,0,0,0,0,0,0,0,0,0,0,0,0,0,0,0,0,0,0,0,0,0,0,0,0,0,0,0,0,0,0,0,0,0,0,0,0,0,0,0,0,0,0,2.89,2.94,2.98,3.03,3.09,3.13,3.18,3.23,3.27,3.48,3.87,3.87,3.87,3.87,3.87,4.2,4.2,4.2,4.2,4.28,4.63,4.63,4.76,4.8099999999999996,4.8099999999999996,5.05,5.05,5.05,5.17,5.22,5.6,5.6,5.68,5.68,5.73,5.98,6.13,6.13,6.13,6.13,6.13,6.13,6.13,6.13,6.13,6.13,6.13,6.13,6.13,6.13,6.13,6.13,6.13,6.13,6.13,6.13]
[9,0,0,0,0,0,0,0,0,0,0,0,0,0,0,0,0,0,0,0,0,0,0,0,0,0,0,0,0,0,0,0,0,0,0,0,0,0,0,0,0,0,0,0,0,0,0,0,0,2.89,2.94,2.98,3.03,3.09,3.13,3.18,3.23,3.27,3.48,3.87,3.87,3.87,3.87,3.87,4.2,4.2,4.2,4.2,4.28,4.63,4.63,4.76,4.8099999999999996,4.8099999999999996,5.05,5.05,5.05,5.17,5.22,5.6,5.6,5.68,5.68,5.73,5.98,6.13,6.13,6.13,6.13,6.13,6.13,6.13,6.13,6.13,6.13,6.13,6.13,6.13,6.13,6.13,6.13,6.13,6.13,6.13,6.13]
[10,0,0,0,0,0,0,0,0,0,0,0,0,0,0,0,0,0,0,0,0,0,0,0,0,0,0,0,0,0,0,0,0,0,0,0,0,0,0,0,0,0,0,0,0,0,0,0,0,2.89,2.94,2.98,3.03,3.09,3.13,3.18,3.23,3.27,3.48,3.87,3.87,3.87,3.87,3.87,4.2,4.2,4.2,4.2,4.28,4.63,4.63,4.76,4.8099999999999996,4.8099999999999996,5.05,5.05,5.05,5.17,5.22,5.6,5.6,5.68,5.68,5.73,5.98,6.13,6.13,6.13,6.13,6.13,6.13,6.13,6.13,6.13,6.13,6.13,6.13,6.13,6.13,6.13,6.13,6.13,6.13,6.13,6.13]
[11,0,0,0,0,0,0,0,0,0,0,0,0,0,0,0,0,0,0,0,0,0,0,0,0,0,0,0,0,0,0,0,0,0,0,0,0,0,0,0,0,0,0,0,0,0,0,0,0,2.89,2.94,2.98,3.03,3.09,3.13,3.18,3.23,3.27,3.48,3.87,3.87,3.87,3.87,3.87,4.2,4.2,4.2,4.2,4.28,4.63,4.63,4.76,4.8099999999999996,4.8099999999999996,5.05,5.05,5.05,5.17,5.22,5.6,5.6,5.68,5.68,5.73,5.98,6.13,6.13,6.13,6.13,6.13,6.13,6.13,6.13,6.13,6.13,6.13,6.13,6.13,6.13,6.13,6.13,6.13,6.13,6.13,6.13]
[12,0,0,0,0,0,0,0,0,0,0,0,0,0,0,0,0,0,0,0,0,0,0,0,0,0,0,0,0,0,0,0,0,0,0,0,0,0,0,0,0,0,0,0,0,0,0,0,0,2.89,2.94,2.98,3.03,3.09,3.13,3.18,3.23,3.27,3.48,3.87,3.87,3.87,3.87,3.87,4.2,4.2,4.2,4.2,4.28,4.63,4.63,4.76,4.8099999999999996,4.8099999999999996,5.05,5.05,5.05,5.17,5.22,5.6,5.6,5.68,5.68,5.73,5.98,6.13,6.13,6.13,6.13,6.13,6.13,6.13,6.13,6.13,6.13,6.13,6.13,6.13,6.13,6.13,6.13,6.13,6.13,6.13,6.13]
[13,0,0,0,0,0,0,0,0,0,0,0,0,0,0,0,0,0,0,0,0,0,0,0,0,0,0,0,0,0,0,0,0,0,0,0,0,0,0,0,0,0,0,0,0,0,0,0,0,2.89,2.94,2.98,3.03,3.09,3.13,3.18,3.23,3.27,3.48,3.87,3.87,3.87,3.87,3.87,4.2,4.2,4.2,4.2,4.28,4.63,4.63,4.76,4.8099999999999996,4.8099999999999996,5.05,5.05,5.05,5.17,5.22,5.6,5.6,5.68,5.68,5.73,5.98,6.13,6.13,6.13,6.13,6.13,6.13,6.13,6.13,6.13,6.13,6.13,6.13,6.13,6.13,6.13,6.13,6.13,6.13,6.13,6.13]
[14,0,0,0,0,0,0,0,0,0,0,0,0,0,0,0,0,0,0,0,0,0,0,0,0,0,0,0,0,0,0,0,0,0,0,0,0,0,0,0,0,0,0,0,0,0,0,0,0,2.89,2.94,2.98,3.03,3.09,3.13,3.18,3.23,3.27,3.48,3.87,3.87,3.87,3.87,3.87,4.2,4.2,4.2,4.2,4.28,4.63,4.63,4.76,4.8099999999999996,4.8099999999999996,5.05,5.05,5.05,5.17,5.22,5.6,5.6,5.68,5.68,5.73,5.98,6.13,6.13,6.13,6.13,6.13,6.13,6.13,6.13,6.13,6.13,6.13,6.13,6.13,6.13,6.13,6.13,6.13,6.13,6.13,6.13]
[15,0,0,0,0,0,0,0,0,0,0,0,0,0,0,0,0,0,0,0,0,0,0,0,0,0,0,0,0,0,0,0,0,0,0,0,0,0,0,0,0,0,0,0,0,0,0,0,0,2.89,2.94,2.98,3.03,3.09,3.13,3.18,3.23,3.27,3.48,3.87,3.87,3.87,3.87,3.87,4.2,4.2,4.2,4.2,4.28,4.63,4.63,4.76,4.8099999999999996,4.8099999999999996,5.05,5.05,5.05,5.17,5.22,5.6,5.6,5.68,5.68,5.73,5.98,6.13,6.13,6.13,6.13,6.13,6.13,6.13,6.13,6.13,6.13,6.13,6.13,6.13,6.13,6.13,6.13,6.13,6.13,6.13,6.13]
[16,0,0,0,0,0,0,0,0,0,0,0,0,0,0,0,0,0,0,0,0,0,0,0,0,0,0,0,0,0,0,0,0,0,0,0,0,0,0,0,0,0,0,0,0,0,0,0,0,2.89,2.94,2.98,3.03,3.09,3.13,3.18,3.23,3.27,3.48,3.87,3.87,3.87,3.87,3.87,4.2,4.2,4.2,4.2,4.28,4.63,4.63,4.76,4.8099999999999996,4.8099999999999996,5.05,5.05,5.05,5.17,5.22,5.6,5.6,5.68,5.68,5.73,5.98,6.13,6.13,6.13,6.13,6.13,6.13,6.13,6.13,6.13,6.13,6.13,6.13,6.13,6.13,6.13,6.13,6.13,6.13,6.13,6.13]
[17,0,0,0,0,0,0,0,0,0,0,0,0,0,0,0,0,0,0,0,0,0,0,0,0,0,0,0,0,0,0,0,0,0,0,0,0,0,0,0,0,0,0,0,0,0,0,0,0,2.89,2.94,2.98,3.03,3.09,3.13,3.18,3.23,3.27,3.48,3.87,3.87,3.87,3.87,3.87,4.2,4.2,4.2,4.2,4.28,4.63,4.63,4.76,4.8099999999999996,4.8099999999999996,5.05,5.05,5.05,5.17,5.22,5.6,5.6,5.68,5.68,5.73,5.98,6.13,6.13,6.13,6.13,6.13,6.13,6.13,6.13,6.13,6.13,6.13,6.13,6.13,6.13,6.13,6.13,6.13,6.13,6.13,6.13]
[18,0,0,0,0,0,0,0,0,0,0,0,0,0,0,0,0,0,0,0,0,0,0,0,0,0,0,0,0,0,0,0,0,0,0,0,0,0,0,0,0,0,0,0,0,0,0,0,0,2.89,2.94,2.98,3.03,3.09,3.13,3.18,3.23,3.27,3.48,3.87,3.87,3.87,3.87,3.87,4.2,4.2,4.2,4.2,4.28,4.63,4.63,4.76,4.8099999999999996,4.8099999999999996,5.05,5.05,5.05,5.17,5.22,5.6,5.6,5.68,5.68,5.73,5.98,6.13,6.13,6.13,6.13,6.13,6.13,6.13,6.13,6.13,6.13,6.13,6.13,6.13,6.13,6.13,6.13,6.13,6.13,6.13,6.13]
[19,0,0,0,0,0,0,0,0,0,0,0,0,0,0,0,0,0,0,0,0,0,0,0,0,0,0,0,0,0,0,0,0,0,0,0,0,0,0,0,0,0,0,0,0,0,0,0,0,2.89,2.94,2.98,3.03,3.09,3.13,3.18,3.23,3.27,3.48,3.87,3.87,3.87,3.87,3.87,4.2,4.2,4.2,4.2,4.28,4.63,4.63,4.76,4.8099999999999996,4.8099999999999996,5.05,5.05,5.05,5.17,5.22,5.6,5.6,5.68,5.68,5.73,5.98,6.13,6.13,6.13,6.13,6.13,6.13,6.13,6.13,6.13,6.13,6.13,6.13,6.13,6.13,6.13,6.13,6.13,6.13,6.13,6.13]
[20,0,0,0,0,0,0,0,0,0,0,0,0,0,0,0,0,0,0,0,0,0,0,0,0,0,0,0,0,0,0,0,0,0,0,0,0,0,0,0,0,0,0,0,0,0,0,0,0,2.89,2.94,2.98,3.03,3.09,3.13,3.18,3.23,3.27,3.48,3.87,3.87,3.87,3.87,3.87,4.2,4.2,4.2,4.2,4.28,4.63,4.63,4.76,4.8099999999999996,4.8099999999999996,5.05,5.05,5.05,5.17,5.22,5.6,5.6,5.68,5.68,5.73,5.98,6.13,6.13,6.13,6.13,6.13,6.13,6.13,6.13,6.13,6.13,6.13,6.13,6.13,6.13,6.13,6.13,6.13,6.13,6.13,6.13]
[21,0,0,0,0,0,0,0,0,0,0,0,0,0,0,0,0,0,0,0,0,0,0,0,0,0,0,0,0,0,0,0,0,0,0,0,0,0,0,0,0,0,0,0,0,0,0,0,0,2.89,2.94,2.98,3.03,3.09,3.13,3.18,3.23,3.27,3.48,3.87,3.87,3.87,3.87,3.87,4.2,4.2,4.2,4.2,4.28,4.63,4.63,4.76,4.8099999999999996,4.8099999999999996,5.05,5.05,5.05,5.17,5.22,5.6,5.6,5.68,5.68,5.73,5.98,6.13,6.13,6.13,6.13,6.13,6.13,6.13,6.13,6.13,6.13,6.13,6.13,6.13,6.13,6.13,6.13,6.13,6.13,6.13,6.13]
[22,0,0,0,0,0,0,0,0,0,0,0,0,0,0,0,0,0,0,0,0,0,0,0,0,0,0,0,0,0,0,0,0,0,0,0,0,0,0,0,0,0,0,0,0,0,0,0,0,2.89,2.94,2.98,3.03,3.09,3.13,3.18,3.23,3.27,3.48,3.87,3.87,3.87,3.87,3.87,4.2,4.2,4.2,4.2,4.28,4.63,4.63,4.76,4.8099999999999996,4.8099999999999996,5.05,5.05,5.05,5.17,5.22,5.6,5.6,5.68,5.68,5.73,5.98,6.13,6.13,6.13,6.13,6.13,6.13,6.13,6.13,6.13,6.13,6.13,6.13,6.13,6.13,6.13,6.13,6.13,6.13,6.13,6.13]
[23,0,0,0,0,0,0,0,0,0,0,0,0,0,0,0,0,0,0,0,0,0,0,0,0,0,0,0,0,0,0,0,0,0,0,0,0,0,0,0,0,0,0,0,0,0,0,0,0,2.89,2.94,2.98,3.03,3.09,3.13,3.18,3.23,3.27,3.48,3.87,3.87,3.87,3.87,3.87,4.2,4.2,4.2,4.2,4.28,4.63,4.63,4.76,4.8099999999999996,4.8099999999999996,5.05,5.05,5.05,5.17,5.22,5.6,5.6,5.68,5.68,5.73,5.98,6.13,6.13,6.13,6.13,6.13,6.13,6.13,6.13,6.13,6.13,6.13,6.13,6.13,6.13,6.13,6.13,6.13,6.13,6.13,6.13]
[24,0,0,0,0,0,0,0,0,0,0,0,0,0,0,0,0,0,0,0,0,0,0,0,0,0,0,0,0,0,0,0,0,0,0,0,0,0,0,0,0,0,0,0,0,0,0,0,0,2.89,2.94,2.98,3.03,3.09,3.13,3.18,3.23,3.27,3.48,3.87,3.87,3.87,3.87,3.87,4.2,4.2,4.2,4.2,4.28,4.63,4.63,4.76,4.8099999999999996,4.8099999999999996,5.05,5.05,5.05,5.17,5.22,5.6,5.6,5.68,5.68,5.73,5.98,6.13,6.13,6.13,6.13,6.13,6.13,6.13,6.13,6.13,6.13,6.13,6.13,6.13,6.13,6.13,6.13,6.13,6.13,6.13,6.13]
[25,0,0,0,0,0,0,0,0,0,0,0,0,0,0,0,0,0,0,0,0,0,0,0,0,0,0,0,0,0,0,0,0,0,0,0,0,0,0,0,0,0,0,0,0,0,0,0,0,2.89,2.94,2.98,3.03,3.09,3.13,3.18,3.23,3.27,3.48,3.87,3.87,3.87,3.87,3.87,4.2,4.2,4.2,4.2,4.28,4.63,4.63,4.76,4.8099999999999996,4.8099999999999996,5.05,5.05,5.05,5.17,5.22,5.6,5.6,5.68,5.68,5.73,5.98,6.13,6.13,6.13,6.13,6.13,6.13,6.13,6.13,6.13,6.13,6.13,6.13,6.13,6.13,6.13,6.13,6.13,6.13,6.13,6.13]
[26,0,0,0,0,0,0,0,0,0,0,0,0,0,0,0,0,0,0,0,0,0,0,0,0,0,0,0,0,0,0,0,0,0,0,0,0,0,0,0,0,0,0,0,0,0,0,0,0,2.89,2.94,2.98,3.03,3.09,3.13,3.18,3.23,3.27,3.48,3.87,3.87,3.87,3.87,3.87,4.2,4.2,4.2,4.2,4.28,4.63,4.63,4.76,4.8099999999999996,4.8099999999999996,5.05,5.05,5.05,5.17,5.22,5.6,5.6,5.68,5.68,5.73,5.98,6.13,6.13,6.13,6.13,6.13,6.13,6.13,6.13,6.13,6.13,6.13,6.13,6.13,6.13,6.13,6.13,6.13,6.13,6.13,6.13]
[27,0,0,0,0,0,0,0,0,0,0,0,0,0,0,0,0,0,0,0,0,0,0,0,0,0,0,0,0,0,0,0,0,0,0,0,0,0,0,0,0,0,0,0,0,0,0,0,0,2.89,2.94,2.98,3.03,3.09,3.13,3.18,3.23,3.27,3.48,3.87,3.87,3.87,3.87,3.87,4.2,4.2,4.2,4.2,4.28,4.63,4.63,4.76,4.8099999999999996,4.8099999999999996,5.05,5.05,5.05,5.17,5.22,5.6,5.6,5.68,5.68,5.73,5.98,6.13,6.13,6.13,6.13,6.13,6.13,6.13,6.13,6.13,6.13,6.13,6.13,6.13,6.13,6.13,6.13,6.13,6.13,6.13,6.13]
[28,0,0,0,0,0,0,0,0,0,0,0,0,0,0,0,0,0,0,0,0,0,0,0,0,0,0,0,0,0,0,0,0,0,0,0,0,0,0,0,0,0,0,0,0,0,0,0,0,2.89,2.94,2.98,3.03,3.09,3.13,3.18,3.23,3.27,3.48,3.87,3.87,3.87,3.87,3.87,4.2,4.2,4.2,4.2,4.28,4.63,4.63,4.76,4.8099999999999996,4.8099999999999996,5.05,5.05,5.05,5.17,5.22,5.6,5.6,5.68,5.68,5.73,5.98,6.13,6.13,6.13,6.13,6.13,6.13,6.13,6.13,6.13,6.13,6.13,6.13,6.13,6.13,6.13,6.13,6.13,6.13,6.13,6.13]
[29,0,0,0,0,0,0,0,0,0,0,0,0,0,0,0,0,0,0,0,0,0,0,0,0,0,0,0,0,0,0,0,0,0,0,0,0,0,0,0,0,0,0,0,0,0,0,0,0,2.89,2.94,2.98,3.03,3.09,3.13,3.18,3.23,3.27,3.48,3.87,3.87,3.87,3.87,3.87,4.2,4.2,4.2,4.2,4.28,4.63,4.63,4.76,4.8099999999999996,4.8099999999999996,5.05,5.05,5.05,5.17,5.22,5.6,5.6,5.68,5.68,5.73,5.98,6.13,6.13,6.13,6.13,6.13,6.13,6.13,6.13,6.13,6.13,6.13,6.13,6.13,6.13,6.13,6.13,6.13,6.13,6.13,6.13]
[30,0,0,0,0,0,0,0,0,0,0,0,0,0,0,0,0,0,0,0,0,0,0,0,0,0,0,0,0,0,0,0,0,0,0,0,0,0,0,0,0,0,0,0,0,0,0,0,0,2.89,2.94,2.98,3.03,3.09,3.13,3.18,3.23,3.27,3.48,3.87,3.87,3.87,3.87,3.87,4.2,4.2,4.2,4.2,4.28,4.63,4.63,4.76,4.8099999999999996,4.8099999999999996,5.05,5.05,5.05,5.17,5.22,5.6,5.6,5.68,5.68,5.73,5.98,6.13,6.13,6.13,6.13,6.13,6.13,6.13,6.13,6.13,6.13,6.13,6.13,6.13,6.13,6.13,6.13,6.13,6.13,6.13,6.13]
[31,0,0,0,0,0,0,0,0,0,0,0,0,0,0,0,0,0,0,0,0,0,0,0,0,0,0,0,0,0,0,0,0,0,0,0,0,0,0,0,0,0,0,0,0,0,0,0,0,2.89,2.94,2.98,3.03,3.09,3.13,3.18,3.23,3.27,3.48,3.87,3.87,3.87,3.87,3.87,4.2,4.2,4.2,4.2,4.28,4.63,4.63,4.76,4.8099999999999996,4.8099999999999996,5.05,5.05,5.05,5.17,5.22,5.6,5.6,5.68,5.68,5.73,5.98,6.13,6.13,6.13,6.13,6.13,6.13,6.13,6.13,6.13,6.13,6.13,6.13,6.13,6.13,6.13,6.13,6.13,6.13,6.13,6.13]
[32,0,0,0,0,0,0,0,0,0,0,0,0,0,0,0,0,0,0,0,0,0,0,0,0,0,0,0,0,0,0,0,0,0,0,0,0,0,0,0,0,0,0,0,0,0,0,0,0,2.89,2.94,2.98,3.03,3.09,3.13,3.18,3.23,3.27,3.48,3.87,3.87,3.87,3.87,3.87,4.2,4.2,4.2,4.2,4.28,4.63,4.63,4.76,4.8099999999999996,4.8099999999999996,5.05,5.05,5.05,5.17,5.22,5.6,5.6,5.68,5.68,5.73,5.98,6.13,6.13,6.13,6.13,6.13,6.13,6.13,6.13,6.13,6.13,6.13,6.13,6.13,6.13,6.13,6.13,6.13,6.13,6.13,6.13]
[33,0,0,0,0,0,0,0,0,0,0,0,0,0,0,0,0,0,0,0,0,0,0,0,0,0,0,0,0,0,0,0,0,0,0,0,0,0,0,0,0,0,0,0,0,0,0,0,0,2.89,2.94,2.98,3.03,3.09,3.13,3.18,3.23,3.27,3.48,3.87,3.87,3.87,3.87,3.87,4.2,4.2,4.2,4.2,4.28,4.63,4.63,4.76,4.8099999999999996,4.8099999999999996,5.05,5.05,5.05,5.17,5.22,5.6,5.6,5.68,5.68,5.73,5.98,6.13,6.13,6.13,6.13,6.13,6.13,6.13,6.13,6.13,6.13,6.13,6.13,6.13,6.13,6.13,6.13,6.13,6.13,6.13,6.13]
[34,0,0,0,0,0,0,0,0,0,0,0,0,0,0,0,0,0,0,0,0,0,0,0,0,0,0,0,0,0,0,0,0,0,0,0,0,0,0,0,0,0,0,0,0,0,0,0,0,2.89,2.94,2.98,3.03,3.09,3.13,3.18,3.23,3.27,3.48,3.87,3.87,3.87,3.87,3.87,4.2,4.2,4.2,4.2,4.28,4.63,4.63,4.76,4.8099999999999996,4.8099999999999996,5.05,5.05,5.05,5.17,5.22,5.6,5.6,5.68,5.68,5.73,5.98,6.13,6.13,6.13,6.13,6.13,6.13,6.13,6.13,6.13,6.13,6.13,6.13,6.13,6.13,6.13,6.13,6.13,6.13,6.13,6.13]
[35,0,0,0,0,0,0,0,0,0,0,0,0,0,0,0,0,0,0,0,0,0,0,0,0,0,0,0,0,0,0,0,0,0,0,0,0,0,0,0,0,0,0,0,0,0,0,0,0,2.89,2.94,2.98,3.03,3.09,3.13,3.18,3.23,3.27,3.48,3.87,3.87,3.87,3.87,3.87,4.2,4.2,4.2,4.2,4.28,4.63,4.63,4.76,4.8099999999999996,4.8099999999999996,5.05,5.05,5.05,5.17,5.22,5.6,5.6,5.68,5.68,5.73,5.98,6.13,6.13,6.13,6.13,6.13,6.13,6.13,6.13,6.13,6.13,6.13,6.13,6.13,6.13,6.13,6.13,6.13,6.13,6.13,6.13]
[36,0,0,0,0,0,0,0,0,0,0,0,0,0,0,0,0,0,0,0,0,0,0,0,0,0,0,0,0,0,0,0,0,0,0,0,0,0,0,0,0,0,0,0,0,0,0,0,0,2.89,2.94,2.98,3.03,3.09,3.13,3.18,3.23,3.27,3.48,3.87,3.87,3.87,3.87,3.87,4.2,4.2,4.2,4.2,4.28,4.63,4.63,4.76,4.8099999999999996,4.8099999999999996,5.05,5.05,5.05,5.17,5.22,5.6,5.6,5.68,5.68,5.73,5.98,6.13,6.13,6.13,6.13,6.13,6.13,6.13,6.13,6.13,6.13,6.13,6.13,6.13,6.13,6.13,6.13,6.13,6.13,6.13,6.13]
[37,0,0,0,0,0,0,0,0,0,0,0,0,0,0,0,0,0,0,0,0,0,0,0,0,0,0,0,0,0,0,0,0,0,0,0,0,0,0,0,0,0,0,0,0,0,0,0,0,2.89,2.94,2.98,3.03,3.09,3.13,3.18,3.23,3.27,3.48,3.87,3.87,3.87,3.87,3.87,4.2,4.2,4.2,4.2,4.28,4.63,4.63,4.76,4.8099999999999996,4.8099999999999996,5.05,5.05,5.05,5.17,5.22,5.6,5.6,5.68,5.68,5.73,5.98,6.13,6.13,6.13,6.13,6.13,6.13,6.13,6.13,6.13,6.13,6.13,6.13,6.13,6.13,6.13,6.13,6.13,6.13,6.13,6.13]
[38,0,0,0,0,0,0,0,0,0,0,0,0,0,0,0,0,0,0,0,0,0,0,0,0,0,0,0,0,0,0,0,0,0,0,0,0,0,0,0,0,0,0,0,0,0,0,0,0,2.89,2.94,2.98,3.03,3.09,3.13,3.18,3.23,3.27,3.48,3.87,3.87,3.87,3.87,3.87,4.2,4.2,4.2,4.2,4.28,4.63,4.63,4.76,4.8099999999999996,4.8099999999999996,5.05,5.05,5.05,5.17,5.22,5.6,5.6,5.68,5.68,5.73,5.98,6.13,6.13,6.13,6.13,6.13,6.13,6.13,6.13,6.13,6.13,6.13,6.13,6.13,6.13,6.13,6.13,6.13,6.13,6.13,6.13]
[39,0,0,0,0,0,0,0,0,0,0,0,0,0,0,0,0,0,0,0,0,0,0,0,0,0,0,0,0,0,0,0,0,0,0,0,0,0,0,0,0,0,0,0,0,0,0,0,0,2.89,2.94,2.98,3.03,3.09,3.13,3.18,3.23,3.27,3.48,3.87,3.87,3.87,3.87,3.87,4.2,4.2,4.2,4.2,4.28,4.63,4.63,4.76,4.8099999999999996,4.8099999999999996,5.05,5.05,5.05,5.17,5.22,5.6,5.6,5.68,5.68,5.73,5.98,6.13,6.13,6.13,6.13,6.13,6.13,6.13,6.13,6.13,6.13,6.13,6.13,6.13,6.13,6.13,6.13,6.13,6.13,6.13,6.13]
[40,0,0,0,0,0,0,0,0,0,0,0,0,0,0,0,0,0,0,0,0,0,0,0,0,0,0,0,0,0,0,0,0,0,0,0,0,0,0,0,0,0,0,0,0,0,0,0,0,2.89,2.94,2.98,3.03,3.09,3.13,3.18,3.23,3.27,3.48,3.87,3.87,3.87,3.87,3.87,4.2,4.2,4.2,4.2,4.28,4.63,4.63,4.76,4.8099999999999996,4.8099999999999996,5.05,5.05,5.05,5.17,5.22,5.6,5.6,5.68,5.68,5.73,5.98,6.13,6.13,6.13,6.13,6.13,6.13,6.13,6.13,6.13,6.13,6.13,6.13,6.13,6.13,6.13,6.13,6.13,6.13,6.13,6.13]
[41,0,0,0,0,0,0,0,0,0,0,0,0,0,0,0,0,0,0,0,0,0,0,0,0,0,0,0,0,0,0,0,0,0,0,0,0,0,0,0,0,0,0,0,0,0,0,0,0,2.89,2.94,2.98,3.03,3.09,3.13,3.18,3.23,3.27,3.48,3.87,3.87,3.87,3.87,3.87,4.2,4.2,4.2,4.2,4.28,4.63,4.63,4.76,4.8099999999999996,4.8099999999999996,5.05,5.05,5.05,5.17,5.22,5.6,5.6,5.68,5.68,5.73,5.98,6.13,6.13,6.13,6.13,6.13,6.13,6.13,6.13,6.13,6.13,6.13,6.13,6.13,6.13,6.13,6.13,6.13,6.13,6.13,6.13]
[42,0,0,0,0,0,0,0,0,0,0,0,0,0,0,0,0,0,0,0,0,0,0,0,0,0,0,0,0,0,0,0,0,0,0,0,0,0,0,0,0,0,0,0,0,0,0,0,0,2.89,2.94,2.98,3.03,3.09,3.13,3.18,3.23,3.27,3.48,3.87,3.87,3.87,3.87,3.87,4.2,4.2,4.2,4.2,4.28,4.63,4.63,4.76,4.8099999999999996,4.8099999999999996,5.05,5.05,5.05,5.17,5.22,5.6,5.6,5.68,5.68,5.73,5.98,6.13,6.13,6.13,6.13,6.13,6.13,6.13,6.13,6.13,6.13,6.13,6.13,6.13,6.13,6.13,6.13,6.13,6.13,6.13,6.13]
[43,0,0,0,0,0,0,0,0,0,0,0,0,0,0,0,0,0,0,0,0,0,0,0,0,0,0,0,0,0,0,0,0,0,0,0,0,0,0,0,0,0,0,0,0,0,0,0,0,2.89,2.94,2.98,3.03,3.09,3.13,3.18,3.23,3.27,3.48,3.87,3.87,3.87,3.87,3.87,4.2,4.2,4.2,4.2,4.28,4.63,4.63,4.76,4.8099999999999996,4.8099999999999996,5.05,5.05,5.05,5.17,5.22,5.6,5.6,5.68,5.68,5.73,5.98,6.13,6.13,6.13,6.13,6.13,6.13,6.13,6.13,6.13,6.13,6.13,6.13,6.13,6.13,6.13,6.13,6.13,6.13,6.13,6.13]
[44,0,0,0,0,0,0,0,0,0,0,0,0,0,0,0,0,0,0,0,0,0,0,0,0,0,0,0,0,0,0,0,0,0,0,0,0,0,0,0,0,0,0,0,0,0,0,0,0,2.89,2.94,2.98,3.03,3.09,3.13,3.18,3.23,3.27,3.48,3.87,3.87,3.87,3.87,3.87,4.2,4.2,4.2,4.2,4.28,4.63,4.63,4.76,4.8099999999999996,4.8099999999999996,5.05,5.05,5.05,5.17,5.22,5.6,5.6,5.68,5.68,5.73,5.98,6.13,6.13,6.13,6.13,6.13,6.13,6.13,6.13,6.13,6.13,6.13,6.13,6.13,6.13,6.13,6.13,6.13,6.13,6.13,6.13]
[45,0,0,0,0,0,0,0,0,0,0,0,0,0,0,0,0,0,0,0,0,0,0,0,0,0,0,0,0,0,0,0,0,0,0,0,0,0,0,0,0,0,0,0,0,0,0,0,0,2.89,2.94,2.98,3.03,3.09,3.13,3.18,3.23,3.27,3.48,3.87,3.87,3.87,3.87,3.87,4.2,4.2,4.2,4.2,4.28,4.63,4.63,4.76,4.8099999999999996,4.8099999999999996,5.05,5.05,5.05,5.17,5.22,5.6,5.6,5.68,5.68,5.73,5.98,6.13,6.13,6.13,6.13,6.13,6.13,6.13,6.13,6.13,6.13,6.13,6.13,6.13,6.13,6.13,6.13,6.13,6.13,6.13,6.13]
[46,0,0,0,0,0,0,0,0,0,0,0,0,0,0,0,0,0,0,0,0,0,0,0,0,0,0,0,0,0,0,0,0,0,0,0,0,0,0,0,0,0,0,0,0,0,0,0,0,2.74,2.94,2.98,3.03,3.09,3.13,3.18,3.23,3.27,3.48,3.87,3.87,3.87,3.87,3.87,4.2,4.2,4.2,4.2,4.28,4.63,4.63,4.76,4.8099999999999996,4.8099999999999996,5.05,5.05,5.05,5.17,5.22,5.6,5.6,5.68,5.68,5.73,5.98,6.13,6.13,6.13,6.13,6.13,6.13,6.13,6.13,6.13,6.13,6.13,6.13,6.13,6.13,6.13,6.13,6.13,6.13,6.13,6.13]
[47,0,0,0,0,0,0,0,0,0,0,0,0,0,0,0,0,0,0,0,0,0,0,0,0,0,0,0,0,0,0,0,0,0,0,0,0,0,0,0,0,0,0,0,0,0,0,0,0,2.56,2.78,2.98,3.03,3.09,3.13,3.18,3.23,3.27,3.48,3.87,3.87,3.87,3.87,3.87,4.2,4.2,4.2,4.2,4.28,4.63,4.63,4.76,4.8099999999999996,4.8099999999999996,5.05,5.05,5.05,5.17,5.22,5.6,5.6,5.68,5.68,5.73,5.98,6.13,6.13,6.13,6.13,6.13,6.13,6.13,6.13,6.13,6.13,6.13,6.13,6.13,6.13,6.13,6.13,6.13,6.13,6.13,6.13]
[48,0,0,0,0,0,0,0,0,0,0,0,0,0,0,0,0,0,0,0,0,0,0,0,0,0,0,0,0,0,0,0,0,0,0,0,0,0,0,0,0,0,0,0,0,0,0,0,0,2.89,2.86,2.83,3.03,3.09,3.13,3.18,3.23,3.27,3.48,3.87,3.87,3.87,3.87,3.87,4.2,4.2,4.2,4.2,4.28,4.63,4.63,4.76,4.8099999999999996,4.8099999999999996,5.05,5.05,5.05,5.17,5.22,5.6,5.6,5.68,5.68,5.73,5.98,6.13,6.13,6.13,6.13,6.13,6.13,6.13,6.13,6.13,6.13,6.13,6.13,6.13,6.13,6.13,6.13,6.13,6.13,6.13,6.13]
[49,0,0,0,0,0,0,0,0,0,0,0,0,0,0,0,0,0,0,0,0,0,0,0,0,0,0,0,0,0,0,0,0,0,0,0,0,0,0,0,0,0,0,0,0,0,0,0,0,2.89,2.94,2.85,2.88,3.09,3.13,3.18,3.23,3.27,3.48,3.87,3.87,3.87,3.87,3.87,4.2,4.2,4.2,4.2,4.28,4.63,4.63,4.76,4.8099999999999996,4.8099999999999996,5.05,5.05,5.05,5.17,5.22,5.6,5.6,5.68,5.68,5.73,5.98,6.13,6.13,6.13,6.13,6.13,6.13,6.13,6.13,6.13,6.13,6.13,6.13,6.13,6.13,6.13,6.13,6.13,6.13,6.13,6.13]
[50,0,0,0,0,0,0,0,0,0,0,0,0,0,0,0,0,0,0,0,0,0,0,0,0,0,0,0,0,0,0,0,0,0,0,0,0,0,0,0,0,0,0,0,0,0,0,0,0,2.89,2.94,2.98,2.89,2.93,3.13,3.18,3.23,3.27,3.48,3.87,3.87,3.87,3.87,3.87,4.2,4.2,4.2,4.2,4.28,4.63,4.63,4.76,4.8099999999999996,4.8099999999999996,5.05,5.05,5.05,5.17,5.22,5.6,5.6,5.68,5.68,5.73,5.98,6.13,6.13,6.13,6.13,6.13,6.13,6.13,6.13,6.13,6.13,6.13,6.13,6.13,6.13,6.13,6.13,6.13,6.13,6.13,6.13]
[51,0,0,0,0,0,0,0,0,0,0,0,0,0,0,0,0,0,0,0,0,0,0,0,0,0,0,0,0,0,0,0,0,0,0,0,0,0,0,0,0,0,0,0,0,0,0,0,0,0,2.94,2.98,3.03,2.94,2.98,3.18,3.23,3.27,3.48,3.87,3.87,3.87,3.87,3.87,4.2,4.2,4.2,4.2,4.28,4.63,4.63,4.76,4.8099999999999996,4.8099999999999996,5.05,5.05,5.05,5.17,5.22,5.6,5.6,5.68,5.68,5.73,5.98,6.13,6.13,6.13,6.13,6.13,6.13,6.13,6.13,6.13,6.13,6.13,6.13,6.13,6.13,6.13,6.13,6.13,6.13,6.13,6.13]
[52,0,0,0,0,0,0,0,0,0,0,0,0,0,0,0,0,0,0,0,0,0,0,0,0,0,0,0,0,0,0,0,0,0,0,0,0,0,0,0,0,0,0,0,0,0,0,0,0,0,0,2.98,3.03,3.09,3,3.04,3.23,3.27,3.48,3.87,3.87,3.87,3.87,3.87,4.2,4.2,4.2,4.2,4.28,4.63,4.63,4.76,4.8099999999999996,4.8099999999999996,5.05,5.05,5.05,5.17,5.22,5.6,5.6,5.68,5.68,5.73,5.98,6.13,6.13,6.13,6.13,6.13,6.13,6.13,6.13,6.13,6.13,6.13,6.13,6.13,6.13,6.13,6.13,6.13,6.13,6.13,6.13]
[53,0,0,0,0,0,0,0,0,0,0,0,0,0,0,0,0,0,0,0,0,0,0,0,0,0,0,0,0,0,0,0,0,0,0,0,0,0,0,0,0,0,0,0,0,0,0,0,0,0,0,0,3.03,3.09,3.13,3.04,3.1,3.27,3.48,3.87,3.87,3.87,3.87,3.87,4.2,4.2,4.2,4.2,4.28,4.63,4.63,4.76,4.8099999999999996,4.8099999999999996,5.05,5.05,5.05,5.17,5.22,5.6,5.6,5.68,5.68,5.73,5.98,6.13,6.13,6.13,6.13,6.13,6.13,6.13,6.13,6.13,6.13,6.13,6.13,6.13,6.13,6.13,6.13,6.13,6.13,6.13,6.13]
[54,0,0,0,0,0,0,0,0,0,0,0,0,0,0,0,0,0,0,0,0,0,0,0,0,0,0,0,0,0,0,0,0,0,0,0,0,0,0,0,0,0,0,0,0,0,0,0,0,0,0,0,0,3.09,3.13,3.18,3.1,3.16,3.41,3.75,3.87,3.87,3.87,3.87,4.2,4.2,4.2,4.2,4.28,4.63,4.63,4.76,4.8099999999999996,4.8099999999999996,5.05,5.05,5.05,5.17,5.22,5.6,5.6,5.68,5.68,5.73,5.98,6.13,6.13,6.13,6.13,6.13,6.13,6.13,6.13,6.13,6.13,6.13,6.13,6.13,6.13,6.13,6.13,6.13,6.13,6.13,6.13]
[55,0,0,0,0,0,0,0,0,0,0,0,0,0,0,0,0,0,0,0,0,0,0,0,0,0,0,0,0,0,0,0,0,0,0,0,0,0,0,0,0,0,0,0,0,0,0,0,0,0,0,0,0,0,3.13,3.18,3.23,3.14,3.23,3.52,3.8,3.87,3.87,3.87,4.2,4.2,4.2,4.2,4.28,4.63,4.63,4.76,4.8099999999999996,4.8099999999999996,5.05,5.05,5.05,5.17,5.22,5.6,5.6,5.68,5.68,5.73,5.98,6.13,6.13,6.13,6.13,6.13,6.13,6.13,6.13,6.13,6.13,6.13,6.13,6.13,6.13,6.13,6.13,6.13,6.13,6.13,6.13]
[56,0,0,0,0,0,0,0,0,0,0,0,0,0,0,0,0,0,0,0,0,0,0,0,0,0,0,0,0,0,0,0,0,0,0,0,0,0,0,0,0,0,0,0,0,0,0,0,0,0,0,0,0,0,0,3.18,3.23,3.27,3.18,3.98,3.87,3.87,3.87,3.87,4.2,4.2,4.2,4.2,4.28,4.63,4.63,4.76,4.8099999999999996,4.8099999999999996,5.05,5.05,5.05,5.17,5.22,5.6,5.6,5.68,5.68,5.73,5.98,6.13,6.13,6.13,6.13,6.13,6.13,6.13,6.13,6.13,6.13,6.13,6.13,6.13,6.13,6.13,6.13,6.13,6.13,6.13,6.13]
[57,0,0,0,0,0,0,0,0,0,0,0,0,0,0,0,0,0,0,0,0,0,0,0,0,0,0,0,0,0,0,0,0,0,0,0,0,0,0,0,0,0,0,0,0,0,0,0,0,0,0,0,0,0,0,0,3.23,3.27,3.48,3.87,3.87,3.87,3.87,3.87,4.2,4.2,4.2,4.2,4.28,4.63,4.63,4.76,4.8099999999999996,4.8099999999999996,5.05,5.05,5.05,5.17,5.22,5.6,5.6,5.68,5.68,5.73,5.98,6.13,6.13,6.13,6.13,6.13,6.13,6.13,6.13,6.13,6.13,6.13,6.13,6.13,6.13,6.13,6.13,6.13,6.13,6.13,6.13]
[58,0,0,0,0,0,0,0,0,0,0,0,0,0,0,0,0,0,0,0,0,0,0,0,0,0,0,0,0,0,0,0,0,0,0,0,0,0,0,0,0,0,0,0,0,0,0,0,0,0,0,0,0,0,0,0,0,3.27,3.5,3.87,3.87,3.87,3.87,3.87,4.2,4.2,4.2,4.2,4.28,4.63,4.63,4.76,4.8099999999999996,4.8099999999999996,5.05,5.05,5.05,5.17,5.22,5.6,5.6,5.68,5.68,5.73,5.98,6.13,6.13,6.13,6.13,6.13,6.13,6.13,6.13,6.13,6.13,6.13,6.13,6.13,6.13,6.13,6.13,6.13,6.13,6.13,6.13]
[59,0,0,0,0,0,0,0,0,0,0,0,0,0,0,0,0,0,0,0,0,0,0,0,0,0,0,0,0,0,0,0,0,0,0,0,0,0,0,0,0,0,0,0,0,0,0,0,0,0,0,0,0,0,0,0,0,0,3.33,3.89,3.87,3.87,3.87,3.87,4.2,4.2,4.2,4.2,4.28,4.63,4.63,4.76,4.8099999999999996,4.8099999999999996,5.05,5.05,5.05,5.17,5.22,5.6,5.6,5.68,5.68,5.73,5.98,6.13,6.13,6.13,6.13,6.13,6.13,6.13,6.13,6.13,6.13,6.13,6.13,6.13,6.13,6.13,6.13,6.13,6.13,6.13,6.13]
[60,0,0,0,0,0,0,0,0,0,0,0,0,0,0,0,0,0,0,0,0,0,0,0,0,0,0,0,0,0,0,0,0,0,0,0,0,0,0,0,0,0,0,0,0,0,0,0,0,0,0,0,0,0,0,0,0,0,0,3.84,3.89,3.87,3.87,3.87,4.2,4.2,4.2,4.2,4.28,4.63,4.63,4.76,4.8099999999999996,4.8099999999999996,5.05,5.05,5.05,5.17,5.22,5.6,5.6,5.68,5.68,5.73,5.98,6.13,6.13,6.13,6.13,6.13,6.13,6.13,6.13,6.13,6.13,6.13,6.13,6.13,6.13,6.13,6.13,6.13,6.13,6.13,6.13]
[61,0,0,0,0,0,0,0,0,0,0,0,0,0,0,0,0,0,0,0,0,0,0,0,0,0,0,0,0,0,0,0,0,0,0,0,0,0,0,0,0,0,0,0,0,0,0,0,0,0,0,0,0,0,0,0,0,0,0,0,3.84,3.9,3.87,3.87,4.2,4.2,4.2,4.2,4.28,4.63,4.63,4.76,4.8099999999999996,4.8099999999999996,5.05,5.05,5.05,5.17,5.22,5.6,5.6,5.68,5.68,5.73,5.98,6.13,6.13,6.13,6.13,6.13,6.13,6.13,6.13,6.13,6.13,6.13,6.13,6.13,6.13,6.13,6.13,6.13,6.13,6.13,6.13]
[62,0,0,0,0,0,0,0,0,0,0,0,0,0,0,0,0,0,0,0,0,0,0,0,0,0,0,0,0,0,0,0,0,0,0,0,0,0,0,0,0,0,0,0,0,0,0,0,0,0,0,0,0,0,0,0,0,0,0,0,0,3.84,3.9,3.87,4.2,4.2,4.2,4.2,4.28,4.63,4.63,4.76,4.8099999999999996,4.8099999999999996,5.05,5.05,5.05,5.17,5.22,5.6,5.6,5.68,5.68,5.73,5.98,6.13,6.13,6.13,6.13,6.13,6.13,6.13,6.13,6.13,6.13,6.13,6.13,6.13,6.13,6.13,6.13,6.13,6.13,6.13,6.13]
[63,0,0,0,0,0,0,0,0,0,0,0,0,0,0,0,0,0,0,0,0,0,0,0,0,0,0,0,0,0,0,0,0,0,0,0,0,0,0,0,0,0,0,0,0,0,0,0,0,0,0,0,0,0,0,0,0,0,0,0,0,0,3.84,3.9,4.2,4.2,4.2,4.2,4.28,4.63,4.63,4.76,4.8099999999999996,4.8099999999999996,5.05,5.05,5.05,5.17,5.22,5.6,5.6,5.68,5.68,5.73,5.98,6.13,6.13,6.13,6.13,6.13,6.13,6.13,6.13,6.13,6.13,6.13,6.13,6.13,6.13,6.13,6.13,6.13,6.13,6.13,6.13]
[64,0,0,0,0,0,0,0,0,0,0,0,0,0,0,0,0,0,0,0,0,0,0,0,0,0,0,0,0,0,0,0,0,0,0,0,0,0,0,0,0,0,0,0,0,0,0,0,0,0,0,0,0,0,0,0,0,0,0,0,0,0,0,3.84,4.26,4.2,4.2,4.2,4.28,4.63,4.63,4.76,4.8099999999999996,4.8099999999999996,5.05,5.05,5.05,5.17,5.22,5.6,5.6,5.68,5.68,5.73,5.98,6.13,6.13,6.13,6.13,6.13,6.13,6.13,6.13,6.13,6.13,6.13,6.13,6.13,6.13,6.13,6.13,6.13,6.13,6.13,6.13]
[65,0,0,0,0,0,0,0,0,0,0,0,0,0,0,0,0,0,0,0,0,0,0,0,0,0,0,0,0,0,0,0,0,0,0,0,0,0,0,0,0,0,0,0,0,0,0,0,0,0,0,0,0,0,0,0,0,0,0,0,0,0,0,0,3.86,4.26,4.2,4.2,4.28,4.63,4.63,4.76,4.8099999999999996,4.8099999999999996,5.05,5.05,5.05,5.17,5.22,5.6,5.6,5.68,5.68,5.73,5.98,6.13,6.13,6.13,6.13,6.13,6.13,6.13,6.13,6.13,6.13,6.13,6.13,6.13,6.13,6.13,6.13,6.13,6.13,6.13,6.13]
[66,0,0,0,0,0,0,0,0,0,0,0,0,0,0,0,0,0,0,0,0,0,0,0,0,0,0,0,0,0,0,0,0,0,0,0,0,0,0,0,0,0,0,0,0,0,0,0,0,0,0,0,0,0,0,0,0,0,0,0,0,0,0,0,0,3.89,4.26,4.2,4.28,4.63,4.63,4.76,4.8099999999999996,4.8099999999999996,5.05,5.05,5.05,5.17,5.22,5.6,5.6,5.68,5.68,5.73,5.98,6.13,6.13,6.13,6.13,6.13,6.13,6.13,6.13,6.13,6.13,6.13,6.13,6.13,6.13,6.13,6.13,6.13,6.13,6.13,6.13]
[67,0,0,0,0,0,0,0,0,0,0,0,0,0,0,0,0,0,0,0,0,0,0,0,0,0,0,0,0,0,0,0,0,0,0,0,0,0,0,0,0,0,0,0,0,0,0,0,0,0,0,0,0,0,0,0,0,0,0,0,0,0,0,0,0,0,3.92,4.26,4.28,4.63,4.63,4.76,4.8099999999999996,4.8099999999999996,5.05,5.05,5.05,5.17,5.22,5.6,5.6,5.68,5.68,5.73,5.98,6.13,6.13,6.13,6.13,6.13,6.13,6.13,6.13,6.13,6.13,6.13,6.13,6.13,6.13,6.13,6.13,6.13,6.13,6.13,6.13]
[{"$f":"A67+1","v":68},0,0,0,0,0,0,0,0,0,0,0,0,0,0,0,0,0,0,0,0,0,0,0,0,0,0,0,0,0,0,0,0,0,0,0,0,0,0,0,0,0,0,0,0,0,0,0,0,0,0,0,0,0,0,0,0,0,0,0,0,0,0,0,0,0,0,3.95,4.3499999999999996,4.63,4.63,4.76,4.8099999999999996,4.8099999999999996,5.05,5.05,5.05,5.17,5.22,5.6,5.6,5.68,5.68,5.73,5.98,6.13,6.13,6.13,6.13,6.13,6.13,6.13,6.13,6.13,6.13,6.13,6.13,6.13,6.13,6.13,6.13,6.13,6.13,6.13,6.13]
[{"$f":"A68+1","v":69},0,0,0,0,0,0,0,0,0,0,0,0,0,0,0,0,0,0,0,0,0,0,0,0,0,0,0,0,0,0,0,0,0,0,0,0,0,0,0,0,0,0,0,0,0,0,0,0,0,0,0,0,0,0,0,0,0,0,0,0,0,0,0,0,0,0,0,3.95,4.75,4.63,4.66,4.8099999999999996,4.8099999999999996,5.05,5.05,5.05,5.17,5.22,5.6,5.6,5.68,5.68,5.73,5.98,6.13,6.13,6.13,6.13,6.13,6.13,6.13,6.13,6.13,6.13,6.13,6.13,6.13,6.13,6.13,6.13,6.13,6.13,6.13,6.13]
[70,0,0,0,0,0,0,0,0,0,0,0,0,0,0,0,0,0,0,0,0,0,0,0,0,0,0,0,0,0,0,0,0,0,0,0,0,0,0,0,0,0,0,0,0,0,0,0,0,0,0,0,0,0,0,0,0,0,0,0,0,0,0,0,0,0,0,0,0,4.22,4.75,4.76,4.71,4.8099999999999996,5.05,5.05,5.05,5.17,5.22,5.6,5.6,5.68,5.68,5.73,5.98,6.13,6.13,6.13,6.13,6.13,6.13,6.13,6.13,6.13,6.13,6.13,6.13,6.13,6.13,6.13,6.13,6.13,6.13,6.13,6.13]
[71,0,0,0,0,0,0,0,0,0,0,0,0,0,0,0,0,0,0,0,0,0,0,0,0,0,0,0,0,0,0,0,0,0,0,0,0,0,0,0,0,0,0,0,0,0,0,0,0,0,0,0,0,0,0,0,0,0,0,0,0,0,0,0,0,0,0,0,0,0,4.37,4.75,4.8,4.76,5.05,5.05,5.05,5.17,5.22,5.6,5.6,5.68,5.68,5.73,5.98,6.13,6.13,6.13,6.13,6.13,6.13,6.13,6.13,6.13,6.13,6.13,6.13,6.13,6.13,6.13,6.13,6.13,6.13,6.13,6.13]
[72,0,0,0,0,0,0,0,0,0,0,0,0,0,0,0,0,0,0,0,0,0,0,0,0,0,0,0,0,0,0,0,0,0,0,0,0,0,0,0,0,0,0,0,0,0,0,0,0,0,0,0,0,0,0,0,0,0,0,0,0,0,0,0,0,0,0,0,0,0,0,4.37,4.76,4.8,5.05,5.05,5.05,5.17,5.22,5.6,5.6,5.68,5.68,5.73,5.98,6.13,6.13,6.13,6.13,6.13,6.13,6.13,6.13,6.13,6.13,6.13,6.13,6.13,6.13,6.13,6.13,6.13,6.13,6.13,6.13]
[73,0,0,0,0,0,0,0,0,0,0,0,0,0,0,0,0,0,0,0,0,0,0,0,0,0,0,0,0,0,0,0,0,0,0,0,0,0,0,0,0,0,0,0,0,0,0,0,0,0,0,0,0,0,0,0,0,0,0,0,0,0,0,0,0,0,0,0,0,0,0,0,4.37,4.8099999999999996,5.04,5.05,5.05,5.17,5.22,5.6,5.6,5.68,5.68,5.73,5.98,6.13,6.13,6.13,6.13,6.13,6.13,6.13,6.13,6.13,6.13,6.13,6.13,6.13,6.13,6.13,6.13,6.13,6.13,6.13,6.13]
[74,0,0,0,0,0,0,0,0,0,0,0,0,0,0,0,0,0,0,0,0,0,0,0,0,0,0,0,0,0,0,0,0,0,0,0,0,0,0,0,0,0,0,0,0,0,0,0,0,0,0,0,0,0,0,0,0,0,0,0,0,0,0,0,0,0,0,0,0,0,0,0,0,4.37,5.17,5.05,5.05,5.17,5.22,5.6,5.6,5.68,5.68,5.73,5.98,6.13,6.13,6.13,6.13,6.13,6.13,6.13,6.13,6.13,6.13,6.13,6.13,6.13,6.13,6.13,6.13,6.13,6.13,6.13,6.13]
[75,0,0,0,0,0,0,0,0,0,0,0,0,0,0,0,0,0,0,0,0,0,0,0,0,0,0,0,0,0,0,0,0,0,0,0,0,0,0,0,0,0,0,0,0,0,0,0,0,0,0,0,0,0,0,0,0,0,0,0,0,0,0,0,0,0,0,0,0,0,0,0,0,0,4.6900000000000004,5.17,5.05,5.17,5.22,5.6,5.6,5.68,5.68,5.73,5.98,6.13,6.13,6.13,6.13,6.13,6.13,6.13,6.13,6.13,6.13,6.13,6.13,6.13,6.13,6.13,6.13,6.13,6.13,6.13,6.13]
[76,0,0,0,0,0,0,0,0,0,0,0,0,0,0,0,0,0,0,0,0,0,0,0,0,0,0,0,0,0,0,0,0,0,0,0,0,0,0,0,0,0,0,0,0,0,0,0,0,0,0,0,0,0,0,0,0,0,0,0,0,0,0,0,0,0,0,0,0,0,0,0,0,0,0,4.71,5.17,5.17,5.22,5.6,5.6,5.68,5.68,5.73,5.98,6.13,6.13,6.13,6.13,6.13,6.13,6.13,6.13,6.13,6.13,6.13,6.13,6.13,6.13,6.13,6.13,6.13,6.13,6.13,6.13]
[77,0,0,0,0,0,0,0,0,0,0,0,0,0,0,0,0,0,0,0,0,0,0,0,0,0,0,0,0,0,0,0,0,0,0,0,0,0,0,0,0,0,0,0,0,0,0,0,0,0,0,0,0,0,0,0,0,0,0,0,0,0,0,0,0,0,0,0,0,0,0,0,0,0,0,0,4.76,5.17,5.22,5.6,5.6,5.68,5.68,5.73,5.98,6.13,6.13,6.13,6.13,6.13,6.13,6.13,6.13,6.13,6.13,6.13,6.13,6.13,6.13,6.13,6.13,6.13,6.13,6.13,6.13]
[78,0,0,0,0,0,0,0,0,0,0,0,0,0,0,0,0,0,0,0,0,0,0,0,0,0,0,0,0,0,0,0,0,0,0,0,0,0,0,0,0,0,0,0,0,0,0,0,0,0,0,0,0,0,0,0,0,0,0,0,0,0,0,0,0,0,0,0,0,0,0,0,0,0,0,0,0,4.8099999999999996,5.27,5.6,5.6,5.68,5.68,5.73,5.98,6.13,6.13,6.13,6.13,6.13,6.13,6.13,6.13,6.13,6.13,6.13,6.13,6.13,6.13,6.13,6.13,6.13,6.13,6.13,6.13]
[79,0,0,0,0,0,0,0,0,0,0,0,0,0,0,0,0,0,0,0,0,0,0,0,0,0,0,0,0,0,0,0,0,0,0,0,0,0,0,0,0,0,0,0,0,0,0,0,0,0,0,0,0,0,0,0,0,0,0,0,0,0,0,0,0,0,0,0,0,0,0,0,0,0,0,0,0,0,4.8600000000000003,5.67,5.6,5.68,5.68,5.73,5.98,6.13,6.13,6.13,6.13,6.13,6.13,6.13,6.13,6.13,6.13,6.13,6.13,6.13,6.13,6.13,6.13,6.13,6.13,6.13,6.13]
[80,0,0,0,0,0,0,0,0,0,0,0,0,0,0,0,0,0,0,0,0,0,0,0,0,0,0,0,0,0,0,0,0,0,0,0,0,0,0,0,0,0,0,0,0,0,0,0,0,0,0,0,0,0,0,0,0,0,0,0,0,0,0,0,0,0,0,0,0,0,0,0,0,0,0,0,0,0,0,5.1100000000000003,5.68,5.68,5.68,5.73,5.98,6.13,6.13,6.13,6.13,6.13,6.13,6.13,6.13,6.13,6.13,6.13,6.13,6.13,6.13,6.13,6.13,6.13,6.13,6.13,6.13]
[81,0,0,0,0,0,0,0,0,0,0,0,0,0,0,0,0,0,0,0,0,0,0,0,0,0,0,0,0,0,0,0,0,0,0,0,0,0,0,0,0,0,0,0,0,0,0,0,0,0,0,0,0,0,0,0,0,0,0,0,0,0,0,0,0,0,0,0,0,0,0,0,0,0,0,0,0,0,0,0,5.17,5.68,5.68,5.68,5.85,6.13,6.13,6.13,6.13,6.13,6.13,6.13,6.13,6.13,6.13,6.13,6.13,6.13,6.13,6.13,6.13,6.13,6.13,6.13,6.13]
[82,0,0,0,0,0,0,0,0,0,0,0,0,0,0,0,0,0,0,0,0,0,0,0,0,0,0,0,0,0,0,0,0,0,0,0,0,0,0,0,0,0,0,0,0,0,0,0,0,0,0,0,0,0,0,0,0,0,0,0,0,0,0,0,0,0,0,0,0,0,0,0,0,0,0,0,0,0,0,0,0,5.22,5.73,5.73,5.68,5.91,6.13,6.13,6.13,6.13,6.13,6.13,6.13,6.13,6.13,6.13,6.13,6.13,6.13,6.13,6.13,6.13,6.13,6.13,6.13]
[83,0,0,0,0,0,0,0,0,0,0,0,0,0,0,0,0,0,0,0,0,0,0,0,0,0,0,0,0,0,0,0,0,0,0,0,0,0,0,0,0,0,0,0,0,0,0,0,0,0,0,0,0,0,0,0,0,0,0,0,0,0,0,0,0,0,0,0,0,0,0,0,0,0,0,0,0,0,0,0,0,0,5.22,5.73,5.98,5.82,5.98,6.13,6.13,6.13,6.13,6.13,6.13,6.13,6.13,6.13,6.13,6.13,6.13,6.13,6.13,6.13,6.13,6.13,6.13]
[84,0,0,0,0,0,0,0,0,0,0,0,0,0,0,0,0,0,0,0,0,0,0,0,0,0,0,0,0,0,0,0,0,0,0,0,0,0,0,0,0,0,0,0,0,0,0,0,0,0,0,0,0,0,0,0,0,0,0,0,0,0,0,0,0,0,0,0,0,0,0,0,0,0,0,0,0,0,0,0,0,0,0,5.27,6.08,6.13,5.98,6.09,6.13,6.13,6.13,6.13,6.13,6.13,6.13,6.13,6.13,6.13,6.13,6.13,6.13,6.13,6.13,6.13,6.13]
[85,0,0,0,0,0,0,0,0,0,0,0,0,0,0,0,0,0,0,0,0,0,0,0,0,0,0,0,0,0,0,0,0,0,0,0,0,0,0,0,0,0,0,0,0,0,0,0,0,0,0,0,0,0,0,0,0,0,0,0,0,0,0,0,0,0,0,0,0,0,0,0,0,0,0,0,0,0,0,0,0,0,0,0,5.32,6.08,6.13,6.03,6.13,6.13,6.13,6.13,6.13,6.13,6.13,6.13,6.13,6.13,6.13,6.13,6.13,6.13,6.13,6.13,6.13]

{"sheet":"PIATomorrowJoint","index":12,"n_rows":85,"n_cols":125,"rows_kept":85,"cut":false,"hidden":true,"merged":[]}
[1,{"$f":"A1+1","v":2},{"$f":"B1+1","v":3},4,5,6,7,8,9,10,11,12,13,14,15,16,17,18,19,20,21,22,23,24,25,26,27,28,29,30,31,32,33,34,35,36,37,38,39,40,41,42,43,44,45,46,47,48,49,50,51,52,53,54,55,56,57,58,59,60,61,62,63,64,65,66,67,{"$f":"BO1+1","v":68},{"$f":"BP1+1","v":69},70,71,72,73,74,75,76,77,78,79,80,81,82,83,84,85,86,87,88,89,90,91,92,93,94,95,96,97,98,99,100,101,102,103,104,105]
[{"$f":"A1+1","v":2},0,0,0,0,0,0,0,0,0,0,0,0,0,0,0,0,0,0,0,0,0,0,0,0,0,0,0,0,0,0,0,0,0,0,0,0,0,0,0,0,0,0,0,0,0,0,0,0,2.46,2.52,2.58,2.65,2.71,2.77,2.83,2.89,2.97,3.04,3.26,3.32,3.42,3.47,3.57,3.62,3.73,4.04,4.04,4.04,4.49,4.49,4.49,4.6500000000000004,4.6500000000000004,4.96,4.96,5.17,5.27,5.38,5.43,5.43,5.43,5.43,5.43,5.58,5.58,5.58,5.58,5.58,5.58,5.58,5.58,5.58,5.68,5.68,5.68,5.68,5.68,5.68,5.68,5.68,5.68,5.68,5.68,5.68,null,81,82,83,84,85,86,87,88,89,90,91,92,93,94,95,96,97,98,"99-105"]
[{"$f":"A2+1","v":3},0,0,0,0,0,0,0,0,0,0,0,0,0,0,0,0,0,0,0,0,0,0,0,0,0,0,0,0,0,0,0,0,0,0,0,0,0,0,0,0,0,0,0,0,0,0,0,0,2.46,2.52,2.58,2.65,2.71,2.77,2.83,2.89,2.97,3.04,3.26,3.32,3.42,3.47,3.57,3.62,3.73,4.04,4.04,4.04,4.49,4.49,4.49,4.6500000000000004,4.6500000000000004,4.96,4.96,5.17,5.27,5.38,5.43,5.43,5.43,5.43,5.43,5.58,5.58,5.58,5.58,5.58,5.58,5.58,5.58,5.58,5.68,5.68,5.68,5.68,5.68,5.68,5.68,5.68,5.68,5.68,5.68,5.68,null,"0-68"]
[4,0,0,0,0,0,0,0,0,0,0,0,0,0,0,0,0,0,0,0,0,0,0,0,0,0,0,0,0,0,0,0,0,0,0,0,0,0,0,0,0,0,0,0,0,0,0,0,0,2.46,2.52,2.58,2.65,2.71,2.77,2.83,2.89,2.97,3.04,3.26,3.32,3.42,3.47,3.57,3.62,3.73,4.04,4.04,4.04,4.49,4.49,4.49,4.6500000000000004,4.6500000000000004,4.96,4.96,5.17,5.27,5.38,5.43,5.43,5.43,5.43,5.43,5.58,5.58,5.58,5.58,5.58,5.58,5.58,5.58,5.58,5.68,5.68,5.68,5.68,5.68,5.68,5.68,5.68,5.68,5.68,5.68,5.68,null,69]
[5,0,0,0,0,0,0,0,0,0,0,0,0,0,0,0,0,0,0,0,0,0,0,0,0,0,0,0,0,0,0,0,0,0,0,0,0,0,0,0,0,0,0,0,0,0,0,0,0,2.46,2.52,2.58,2.65,2.71,2.77,2.83,2.89,2.97,3.04,3.26,3.32,3.42,3.47,3.57,3.62,3.73,4.04,4.04,4.04,4.49,4.49,4.49,4.6500000000000004,4.6500000000000004,4.96,4.96,5.17,5.27,5.38,5.43,5.43,5.43,5.43,5.43,5.58,5.58,5.58,5.58,5.58,5.58,5.58,5.58,5.58,5.68,5.68,5.68,5.68,5.68,5.68,5.68,5.68,5.68,5.68,5.68,5.68,null,70]
[6,0,0,0,0,0,0,0,0,0,0,0,0,0,0,0,0,0,0,0,0,0,0,0,0,0,0,0,0,0,0,0,0,0,0,0,0,0,0,0,0,0,0,0,0,0,0,0,0,2.46,2.52,2.58,2.65,2.71,2.77,2.83,2.89,2.97,3.04,3.26,3.32,3.42,3.47,3.57,3.62,3.73,4.04,4.04,4.04,4.49,4.49,4.49,4.6500000000000004,4.6500000000000004,4.96,4.96,5.17,5.27,5.38,5.43,5.43,5.43,5.43,5.43,5.58,5.58,5.58,5.58,5.58,5.58,5.58,5.58,5.58,5.68,5.68,5.68,5.68,5.68,5.68,5.68,5.68,5.68,5.68,5.68,5.68,null,71]
[7,0,0,0,0,0,0,0,0,0,0,0,0,0,0,0,0,0,0,0,0,0,0,0,0,0,0,0,0,0,0,0,0,0,0,0,0,0,0,0,0,0,0,0,0,0,0,0,0,2.46,2.52,2.58,2.65,2.71,2.77,2.83,2.89,2.97,3.04,3.26,3.32,3.42,3.47,3.57,3.62,3.73,4.04,4.04,4.04,4.49,4.49,4.49,4.6500000000000004,4.6500000000000004,4.96,4.96,5.17,5.27,5.38,5.43,5.43,5.43,5.43,5.43,5.58,5.58,5.58,5.58,5.58,5.58,5.58,5.58,5.58,5.68,5.68,5.68,5.68,5.68,5.68,5.68,5.68,5.68,5.68,5.68,5.68,null,72]
[8,0,0,0,0,0,0,0,0,0,0,0,0,0,0,0,0,0,0,0,0,0,0,0,0,0,0,0,0,0,0,0,0,0,0,0,0,0,0,0,0,0,0,0,0,0,0,0,0,2.46,2.52,2.58,2.65,2.71,2.77,2.83,2.89,2.97,3.04,3.26,3.32,3.42,3.47,3.57,3.62,3.73,4.04,4.04,4.04,4.49,4.49,4.49,4.6500000000000004,4.6500000000000004,4.96,4.96,5.17,5.27,5.38,5.43,5.43,5.43,5.43,5.43,5.58,5.58,5.58,5.58,5.58,5.58,5.58,5.58,5.58,5.68,5.68,5.68,5.68,5.68,5.68,5.68,5.68,5.68,5.68,5.68,5.68,null,73]
[9,0,0,0,0,0,0,0,0,0,0,0,0,0,0,0,0,0,0,0,0,0,0,0,0,0,0,0,0,0,0,0,0,0,0,0,0,0,0,0,0,0,0,0,0,0,0,0,0,2.46,2.52,2.58,2.65,2.71,2.77,2.83,2.89,2.97,3.04,3.26,3.32,3.42,3.47,3.57,3.62,3.73,4.04,4.04,4.04,4.49,4.49,4.49,4.6500000000000004,4.6500000000000004,4.96,4.96,5.17,5.27,5.38,5.43,5.43,5.43,5.43,5.43,5.58,5.58,5.58,5.58,5.58,5.58,5.58,5.58,5.58,5.68,5.68,5.68,5.68,5.68,5.68,5.68,5.68,5.68,5.68,5.68,5.68,null,74]
[10,0,0,0,0,0,0,0,0,0,0,0,0,0,0,0,0,0,0,0,0,0,0,0,0,0,0,0,0,0,0,0,0,0,0,0,0,0,0,0,0,0,0,0,0,0,0,0,0,2.46,2.52,2.58,2.65,2.71,2.77,2.83,2.89,2.97,3.04,3.26,3.32,3.42,3.47,3.57,3.62,3.73,4.04,4.04,4.04,4.49,4.49,4.49,4.6500000000000004,4.6500000000000004,4.96,4.96,5.17,5.27,5.38,5.43,5.43,5.43,5.43,5.43,5.58,5.58,5.58,5.58,5.58,5.58,5.58,5.58,5.58,5.68,5.68,5.68,5.68,5.68,5.68,5.68,5.68,5.68,5.68,5.68,5.68,null,75]
[11,0,0,0,0,0,0,0,0,0,0,0,0,0,0,0,0,0,0,0,0,0,0,0,0,0,0,0,0,0,0,0,0,0,0,0,0,0,0,0,0,0,0,0,0,0,0,0,0,2.46,2.52,2.58,2.65,2.71,2.77,2.83,2.89,2.97,3.04,3.26,3.32,3.42,3.47,3.57,3.62,3.73,4.04,4.04,4.04,4.49,4.49,4.49,4.6500000000000004,4.6500000000000004,4.96,4.96,5.17,5.27,5.38,5.43,5.43,5.43,5.43,5.43,5.58,5.58,5.58,5.58,5.58,5.58,5.58,5.58,5.58,5.68,5.68,5.68,5.68,5.68,5.68,5.68,5.68,5.68,5.68,5.68,5.68,null,76]
[12,0,0,0,0,0,0,0,0,0,0,0,0,0,0,0,0,0,0,0,0,0,0,0,0,0,0,0,0,0,0,0,0,0,0,0,0,0,0,0,0,0,0,0,0,0,0,0,0,2.46,2.52,2.58,2.65,2.71,2.77,2.83,2.89,2.97,3.04,3.26,3.32,3.42,3.47,3.57,3.62,3.73,4.04,4.04,4.04,4.49,4.49,4.49,4.6500000000000004,4.6500000000000004,4.96,4.96,5.17,5.27,5.38,5.43,5.43,5.43,5.43,5.43,5.58,5.58,5.58,5.58,5.58,5.58,5.58,5.58,5.58,5.68,5.68,5.68,5.68,5.68,5.68,5.68,5.68,5.68,5.68,5.68,5.68,null,77]
[13,0,0,0,0,0,0,0,0,0,0,0,0,0,0,0,0,0,0,0,0,0,0,0,0,0,0,0,0,0,0,0,0,0,0,0,0,0,0,0,0,0,0,0,0,0,0,0,0,2.46,2.52,2.58,2.65,2.71,2.77,2.83,2.89,2.97,3.04,3.26,3.32,3.42,3.47,3.57,3.62,3.73,4.04,4.04,4.04,4.49,4.49,4.49,4.6500000000000004,4.6500000000000004,4.96,4.96,5.17,5.27,5.38,5.43,5.43,5.43,5.43,5.43,5.58,5.58,5.58,5.58,5.58,5.58,5.58,5.58,5.58,5.68,5.68,5.68,5.68,5.68,5.68,5.68,5.68,5.68,5.68,5.68,5.68,null,78]
[14,0,0,0,0,0,0,0,0,0,0,0,0,0,0,0,0,0,0,0,0,0,0,0,0,0,0,0,0,0,0,0,0,0,0,0,0,0,0,0,0,0,0,0,0,0,0,0,0,2.46,2.52,2.58,2.65,2.71,2.77,2.83,2.89,2.97,3.04,3.26,3.32,3.42,3.47,3.57,3.62,3.73,4.04,4.04,4.04,4.49,4.49,4.49,4.6500000000000004,4.6500000000000004,4.96,4.96,5.17,5.27,5.38,5.43,5.43,5.43,5.43,5.43,5.58,5.58,5.58,5.58,5.58,5.58,5.58,5.58,5.58,5.68,5.68,5.68,5.68,5.68,5.68,5.68,5.68,5.68,5.68,5.68,5.68,null,79]
[15,0,0,0,0,0,0,0,0,0,0,0,0,0,0,0,0,0,0,0,0,0,0,0,0,0,0,0,0,0,0,0,0,0,0,0,0,0,0,0,0,0,0,0,0,0,0,0,0,2.46,2.52,2.58,2.65,2.71,2.77,2.83,2.89,2.97,3.04,3.26,3.32,3.42,3.47,3.57,3.62,3.73,4.04,4.04,4.04,4.49,4.49,4.49,4.6500000000000004,4.6500000000000004,4.96,4.96,5.17,5.27,5.38,5.43,5.43,5.43,5.43,5.43,5.58,5.58,5.58,5.58,5.58,5.58,5.58,5.58,5.58,5.68,5.68,5.68,5.68,5.68,5.68,5.68,5.68,5.68,5.68,5.68,5.68,null,80]
[16,0,0,0,0,0,0,0,0,0,0,0,0,0,0,0,0,0,0,0,0,0,0,0,0,0,0,0,0,0,0,0,0,0,0,0,0,0,0,0,0,0,0,0,0,0,0,0,0,2.46,2.52,2.58,2.65,2.71,2.77,2.83,2.89,2.97,3.04,3.26,3.32,3.42,3.47,3.57,3.62,3.73,4.04,4.04,4.04,4.49,4.49,4.49,4.6500000000000004,4.6500000000000004,4.96,4.96,5.17,5.27,5.38,5.43,5.43,5.43,5.43,5.43,5.58,5.58,5.58,5.58,5.58,5.58,5.58,5.58,5.58,5.68,5.68,5.68,5.68,5.68,5.68,5.68,5.68,5.68,5.68,5.68,5.68,null,81]
[17,0,0,0,0,0,0,0,0,0,0,0,0,0,0,0,0,0,0,0,0,0,0,0,0,0,0,0,0,0,0,0,0,0,0,0,0,0,0,0,0,0,0,0,0,0,0,0,0,2.46,2.52,2.58,2.65,2.71,2.77,2.83,2.89,2.97,3.04,3.26,3.32,3.42,3.47,3.57,3.62,3.73,4.04,4.04,4.04,4.49,4.49,4.49,4.6500000000000004,4.6500000000000004,4.96,4.96,5.17,5.27,5.38,5.43,5.43,5.43,5.43,5.43,5.58,5.58,5.58,5.58,5.58,5.58,5.58,5.58,5.58,5.68,5.68,5.68,5.68,5.68,5.68,5.68,5.68,5.68,5.68,5.68,5.68,null,82]
[18,0,0,0,0,0,0,0,0,0,0,0,0,0,0,0,0,0,0,0,0,0,0,0,0,0,0,0,0,0,0,0,0,0,0,0,0,0,0,0,0,0,0,0,0,0,0,0,0,2.46,2.52,2.58,2.65,2.71,2.77,2.83,2.89,2.97,3.04,3.26,3.32,3.42,3.47,3.57,3.62,3.73,4.04,4.04,4.04,4.49,4.49,4.49,4.6500000000000004,4.6500000000000004,4.96,4.96,5.17,5.27,5.38,5.43,5.43,5.43,5.43,5.43,5.58,5.58,5.58,5.58,5.58,5.58,5.58,5.58,5.58,5.68,5.68,5.68,5.68,5.68,5.68,5.68,5.68,5.68,5.68,5.68,5.68,null,83]
[19,0,0,0,0,0,0,0,0,0,0,0,0,0,0,0,0,0,0,0,0,0,0,0,0,0,0,0,0,0,0,0,0,0,0,0,0,0,0,0,0,0,0,0,0,0,0,0,0,2.46,2.52,2.58,2.65,2.71,2.77,2.83,2.89,2.97,3.04,3.26,3.32,3.42,3.47,3.57,3.62,3.73,4.04,4.04,4.04,4.49,4.49,4.49,4.6500000000000004,4.6500000000000004,4.96,4.96,5.17,5.27,5.38,5.43,5.43,5.43,5.43,5.43,5.58,5.58,5.58,5.58,5.58,5.58,5.58,5.58,5.58,5.68,5.68,5.68,5.68,5.68,5.68,5.68,5.68,5.68,5.68,5.68,5.68,null,84]
[20,0,0,0,0,0,0,0,0,0,0,0,0,0,0,0,0,0,0,0,0,0,0,0,0,0,0,0,0,0,0,0,0,0,0,0,0,0,0,0,0,0,0,0,0,0,0,0,0,2.46,2.52,2.58,2.65,2.71,2.77,2.83,2.89,2.97,3.04,3.26,3.32,3.42,3.47,3.57,3.62,3.73,4.04,4.04,4.04,4.49,4.49,4.49,4.6500000000000004,4.6500000000000004,4.96,4.96,5.17,5.27,5.38,5.43,5.43,5.43,5.43,5.43,5.58,5.58,5.58,5.58,5.58,5.58,5.58,5.58,5.58,5.68,5.68,5.68,5.68,5.68,5.68,5.68,5.68,5.68,5.68,5.68,5.68,null,85]
[21,0,0,0,0,0,0,0,0,0,0,0,0,0,0,0,0,0,0,0,0,0,0,0,0,0,0,0,0,0,0,0,0,0,0,0,0,0,0,0,0,0,0,0,0,0,0,0,0,2.46,2.52,2.58,2.65,2.71,2.77,2.83,2.89,2.97,3.04,3.26,3.32,3.42,3.47,3.57,3.62,3.73,4.04,4.04,4.04,4.49,4.49,4.49,4.6500000000000004,4.6500000000000004,4.96,4.96,5.17,5.27,5.38,5.43,5.43,5.43,5.43,5.43,5.58,5.58,5.58,5.58,5.58,5.58,5.58,5.58,5.58,5.68,5.68,5.68,5.68,5.68,5.68,5.68,5.68,5.68,5.68,5.68,5.68,null,74]
[22,0,0,0,0,0,0,0,0,0,0,0,0,0,0,0,0,0,0,0,0,0,0,0,0,0,0,0,0,0,0,0,0,0,0,0,0,0,0,0,0,0,0,0,0,0,0,0,0,2.46,2.52,2.58,2.65,2.71,2.77,2.83,2.89,2.97,3.04,3.26,3.32,3.42,3.47,3.57,3.62,3.73,4.04,4.04,4.04,4.49,4.49,4.49,4.6500000000000004,4.6500000000000004,4.96,4.96,5.17,5.27,5.38,5.43,5.43,5.43,5.43,5.43,5.58,5.58,5.58,5.58,5.58,5.58,5.58,5.58,5.58,5.68,5.68,5.68,5.68,5.68,5.68,5.68,5.68,5.68,5.68,5.68,5.68,null,75]
[23,0,0,0,0,0,0,0,0,0,0,0,0,0,0,0,0,0,0,0,0,0,0,0,0,0,0,0,0,0,0,0,0,0,0,0,0,0,0,0,0,0,0,0,0,0,0,0,0,2.46,2.52,2.58,2.65,2.71,2.77,2.83,2.89,2.97,3.04,3.26,3.32,3.42,3.47,3.57,3.62,3.73,4.04,4.04,4.04,4.49,4.49,4.49,4.6500000000000004,4.6500000000000004,4.96,4.96,5.17,5.27,5.38,5.43,5.43,5.43,5.43,5.43,5.58,5.58,5.58,5.58,5.58,5.58,5.58,5.58,5.58,5.68,5.68,5.68,5.68,5.68,5.68,5.68,5.68,5.68,5.68,5.68,5.68,null,76]
[24,0,0,0,0,0,0,0,0,0,0,0,0,0,0,0,0,0,0,0,0,0,0,0,0,0,0,0,0,0,0,0,0,0,0,0,0,0,0,0,0,0,0,0,0,0,0,0,0,2.46,2.52,2.58,2.65,2.71,2.77,2.83,2.89,2.97,3.04,3.26,3.32,3.42,3.47,3.57,3.62,3.73,4.04,4.04,4.04,4.49,4.49,4.49,4.6500000000000004,4.6500000000000004,4.96,4.96,5.17,5.27,5.38,5.43,5.43,5.43,5.43,5.43,5.58,5.58,5.58,5.58,5.58,5.58,5.58,5.58,5.58,5.68,5.68,5.68,5.68,5.68,5.68,5.68,5.68,5.68,5.68,5.68,5.68,null,77]
[25,0,0,0,0,0,0,0,0,0,0,0,0,0,0,0,0,0,0,0,0,0,0,0,0,0,0,0,0,0,0,0,0,0,0,0,0,0,0,0,0,0,0,0,0,0,0,0,0,2.46,2.52,2.58,2.65,2.71,2.77,2.83,2.89,2.97,3.04,3.26,3.32,3.42,3.47,3.57,3.62,3.73,4.04,4.04,4.04,4.49,4.49,4.49,4.6500000000000004,4.6500000000000004,4.96,4.96,5.17,5.27,5.38,5.43,5.43,5.43,5.43,5.43,5.58,5.58,5.58,5.58,5.58,5.58,5.58,5.58,5.58,5.68,5.68,5.68,5.68,5.68,5.68,5.68,5.68,5.68,5.68,5.68,5.68,null,78]
[26,0,0,0,0,0,0,0,0,0,0,0,0,0,0,0,0,0,0,0,0,0,0,0,0,0,0,0,0,0,0,0,0,0,0,0,0,0,0,0,0,0,0,0,0,0,0,0,0,2.46,2.52,2.58,2.65,2.71,2.77,2.83,2.89,2.97,3.04,3.26,3.32,3.42,3.47,3.57,3.62,3.73,4.04,4.04,4.04,4.49,4.49,4.49,4.6500000000000004,4.6500000000000004,4.96,4.96,5.17,5.27,5.38,5.43,5.43,5.43,5.43,5.43,5.58,5.58,5.58,5.58,5.58,5.58,5.58,5.58,5.58,5.68,5.68,5.68,5.68,5.68,5.68,5.68,5.68,5.68,5.68,5.68,5.68,null,79]
[27,0,0,0,0,0,0,0,0,0,0,0,0,0,0,0,0,0,0,0,0,0,0,0,0,0,0,0,0,0,0,0,0,0,0,0,0,0,0,0,0,0,0,0,0,0,0,0,0,2.46,2.52,2.58,2.65,2.71,2.77,2.83,2.89,2.97,3.04,3.26,3.32,3.42,3.47,3.57,3.62,3.73,4.04,4.04,4.04,4.49,4.49,4.49,4.6500000000000004,4.6500000000000004,4.96,4.96,5.17,5.27,5.38,5.43,5.43,5.43,5.43,5.43,5.58,5.58,5.58,5.58,5.58,5.58,5.58,5.58,5.58,5.68,5.68,5.68,5.68,5.68,5.68,5.68,5.68,5.68,5.68,5.68,5.68,null,80]
[28,0,0,0,0,0,0,0,0,0,0,0,0,0,0,0,0,0,0,0,0,0,0,0,0,0,0,0,0,0,0,0,0,0,0,0,0,0,0,0,0,0,0,0,0,0,0,0,0,2.46,2.52,2.58,2.65,2.71,2.77,2.83,2.89,2.97,3.04,3.26,3.32,3.42,3.47,3.57,3.62,3.73,4.04,4.04,4.04,4.49,4.49,4.49,4.6500000000000004,4.6500000000000004,4.96,4.96,5.17,5.27,5.38,5.43,5.43,5.43,5.43,5.43,5.58,5.58,5.58,5.58,5.58,5.58,5.58,5.58,5.58,5.68,5.68,5.68,5.68,5.68,5.68,5.68,5.68,5.68,5.68,5.68,5.68]
[29,0,0,0,0,0,0,0,0,0,0,0,0,0,0,0,0,0,0,0,0,0,0,0,0,0,0,0,0,0,0,0,0,0,0,0,0,0,0,0,0,0,0,0,0,0,0,0,0,2.46,2.52,2.58,2.65,2.71,2.77,2.83,2.89,2.97,3.04,3.26,3.32,3.42,3.47,3.57,3.62,3.73,4.04,4.04,4.04,4.49,4.49,4.49,4.6500000000000004,4.6500000000000004,4.96,4.96,5.17,5.27,5.38,5.43,5.43,5.43,5.43,5.43,5.58,5.58,5.58,5.58,5.58,5.58,5.58,5.58,5.58,5.68,5.68,5.68,5.68,5.68,5.68,5.68,5.68,5.68,5.68,5.68,5.68]
[30,0,0,0,0,0,0,0,0,0,0,0,0,0,0,0,0,0,0,0,0,0,0,0,0,0,0,0,0,0,0,0,0,0,0,0,0,0,0,0,0,0,0,0,0,0,0,0,0,2.46,2.52,2.58,2.65,2.71,2.77,2.83,2.89,2.97,3.04,3.26,3.32,3.42,3.47,3.57,3.62,3.73,4.04,4.04,4.04,4.49,4.49,4.49,4.6500000000000004,4.6500000000000004,4.96,4.96,5.17,5.27,5.38,5.43,5.43,5.43,5.43,5.43,5.58,5.58,5.58,5.58,5.58,5.58,5.58,5.58,5.58,5.68,5.68,5.68,5.68,5.68,5.68,5.68,5.68,5.68,5.68,5.68,5.68]
[31,0,0,0,0,0,0,0,0,0,0,0,0,0,0,0,0,0,0,0,0,0,0,0,0,0,0,0,0,0,0,0,0,0,0,0,0,0,0,0,0,0,0,0,0,0,0,0,0,2.46,2.52,2.58,2.65,2.71,2.77,2.83,2.89,2.97,3.04,3.26,3.32,3.42,3.47,3.57,3.62,3.73,4.04,4.04,4.04,4.49,4.49,4.49,4.6500000000000004,4.6500000000000004,4.96,4.96,5.17,5.27,5.38,5.43,5.43,5.43,5.43,5.43,5.58,5.58,5.58,5.58,5.58,5.58,5.58,5.58,5.58,5.68,5.68,5.68,5.68,5.68,5.68,5.68,5.68,5.68,5.68,5.68,5.68]
[32,0,0,0,0,0,0,0,0,0,0,0,0,0,0,0,0,0,0,0,0,0,0,0,0,0,0,0,0,0,0,0,0,0,0,0,0,0,0,0,0,0,0,0,0,0,0,0,0,2.46,2.52,2.58,2.65,2.71,2.77,2.83,2.89,2.97,3.04,3.26,3.32,3.42,3.47,3.57,3.62,3.73,4.04,4.04,4.04,4.49,4.49,4.49,4.6500000000000004,4.6500000000000004,4.96,4.96,5.17,5.27,5.38,5.43,5.43,5.43,5.43,5.43,5.58,5.58,5.58,5.58,5.58,5.58,5.58,5.58,5.58,5.68,5.68,5.68,5.68,5.68,5.68,5.68,5.68,5.68,5.68,5.68,5.68]
[33,0,0,0,0,0,0,0,0,0,0,0,0,0,0,0,0,0,0,0,0,0,0,0,0,0,0,0,0,0,0,0,0,0,0,0,0,0,0,0,0,0,0,0,0,0,0,0,0,2.46,2.52,2.58,2.65,2.71,2.77,2.83,2.89,2.97,3.04,3.26,3.32,3.42,3.47,3.57,3.62,3.73,4.04,4.04,4.04,4.49,4.49,4.49,4.6500000000000004,4.6500000000000004,4.96,4.96,5.17,5.27,5.38,5.43,5.43,5.43,5.43,5.43,5.58,5.58,5.58,5.58,5.58,5.58,5.58,5.58,5.58,5.68,5.68,5.68,5.68,5.68,5.68,5.68,5.68,5.68,5.68,5.68,5.68]
[34,0,0,0,0,0,0,0,0,0,0,0,0,0,0,0,0,0,0,0,0,0,0,0,0,0,0,0,0,0,0,0,0,0,0,0,0,0,0,0,0,0,0,0,0,0,0,0,0,2.46,2.52,2.58,2.65,2.71,2.77,2.83,2.89,2.97,3.04,3.26,3.32,3.42,3.47,3.57,3.62,3.73,4.04,4.04,4.04,4.49,4.49,4.49,4.6500000000000004,4.6500000000000004,4.96,4.96,5.17,5.27,5.38,5.43,5.43,5.43,5.43,5.43,5.58,5.58,5.58,5.58,5.58,5.58,5.58,5.58,5.58,5.68,5.68,5.68,5.68,5.68,5.68,5.68,5.68,5.68,5.68,5.68,5.68]
[35,0,0,0,0,0,0,0,0,0,0,0,0,0,0,0,0,0,0,0,0,0,0,0,0,0,0,0,0,0,0,0,0,0,0,0,0,0,0,0,0,0,0,0,0,0,0,0,0,2.46,2.52,2.58,2.65,2.71,2.77,2.83,2.89,2.97,3.04,3.26,3.32,3.42,3.47,3.57,3.62,3.73,4.04,4.04,4.04,4.49,4.49,4.49,4.6500000000000004,4.6500000000000004,4.96,4.96,5.17,5.27,5.38,5.43,5.43,5.43,5.43,5.43,5.58,5.58,5.58,5.58,5.58,5.58,5.58,5.58,5.58,5.68,5.68,5.68,5.68,5.68,5.68,5.68,5.68,5.68,5.68,5.68,5.68]
[36,0,0,0,0,0,0,0,0,0,0,0,0,0,0,0,0,0,0,0,0,0,0,0,0,0,0,0,0,0,0,0,0,0,0,0,0,0,0,0,0,0,0,0,0,0,0,0,0,2.46,2.52,2.58,2.65,2.71,2.77,2.83,2.89,2.97,3.04,3.26,3.32,3.42,3.47,3.57,3.62,3.73,4.04,4.04,4.04,4.49,4.49,4.49,4.6500000000000004,4.6500000000000004,4.96,4.96,5.17,5.27,5.38,5.43,5.43,5.43,5.43,5.43,5.58,5.58,5.58,5.58,5.58,5.58,5.58,5.58,5.58,5.68,5.68,5.68,5.68,5.68,5.68,5.68,5.68,5.68,5.68,5.68,5.68]
[37,0,0,0,0,0,0,0,0,0,0,0,0,0,0,0,0,0,0,0,0,0,0,0,0,0,0,0,0,0,0,0,0,0,0,0,0,0,0,0,0,0,0,0,0,0,0,0,0,2.46,2.52,2.58,2.65,2.71,2.77,2.83,2.89,2.97,3.04,3.26,3.32,3.42,3.47,3.57,3.62,3.73,4.04,4.04,4.04,4.49,4.49,4.49,4.6500000000000004,4.6500000000000004,4.96,4.96,5.17,5.27,5.38,5.43,5.43,5.43,5.43,5.43,5.58,5.58,5.58,5.58,5.58,5.58,5.58,5.58,5.58,5.68,5.68,5.68,5.68,5.68,5.68,5.68,5.68,5.68,5.68,5.68,5.68]
[38,0,0,0,0,0,0,0,0,0,0,0,0,0,0,0,0,0,0,0,0,0,0,0,0,0,0,0,0,0,0,0,0,0,0,0,0,0,0,0,0,0,0,0,0,0,0,0,0,2.46,2.52,2.58,2.65,2.71,2.77,2.83,2.89,2.97,3.04,3.26,3.32,3.42,3.47,3.57,3.62,3.73,4.04,4.04,4.04,4.49,4.49,4.49,4.6500000000000004,4.6500000000000004,4.96,4.96,5.17,5.27,5.38,5.43,5.43,5.43,5.43,5.43,5.58,5.58,5.58,5.58,5.58,5.58,5.58,5.58,5.58,5.68,5.68,5.68,5.68,5.68,5.68,5.68,5.68,5.68,5.68,5.68,5.68]
[39,0,0,0,0,0,0,0,0,0,0,0,0,0,0,0,0,0,0,0,0,0,0,0,0,0,0,0,0,0,0,0,0,0,0,0,0,0,0,0,0,0,0,0,0,0,0,0,0,2.46,2.52,2.58,2.65,2.71,2.77,2.83,2.89,2.97,3.04,3.26,3.32,3.42,3.47,3.57,3.62,3.73,4.04,4.04,4.04,4.49,4.49,4.49,4.6500000000000004,4.6500000000000004,4.96,4.96,5.17,5.27,5.38,5.43,5.43,5.43,5.43,5.43,5.58,5.58,5.58,5.58,5.58,5.58,5.58,5.58,5.58,5.68,5.68,5.68,5.68,5.68,5.68,5.68,5.68,5.68,5.68,5.68,5.68]
[40,0,0,0,0,0,0,0,0,0,0,0,0,0,0,0,0,0,0,0,0,0,0,0,0,0,0,0,0,0,0,0,0,0,0,0,0,0,0,0,0,0,0,0,0,0,0,0,0,2.46,2.52,2.58,2.65,2.71,2.77,2.83,2.89,2.97,3.04,3.26,3.32,3.42,3.47,3.57,3.62,3.73,4.04,4.04,4.04,4.49,4.49,4.49,4.6500000000000004,4.6500000000000004,4.96,4.96,5.17,5.27,5.38,5.43,5.43,5.43,5.43,5.43,5.58,5.58,5.58,5.58,5.58,5.58,5.58,5.58,5.58,5.68,5.68,5.68,5.68,5.68,5.68,5.68,5.68,5.68,5.68,5.68,5.68]
[41,0,0,0,0,0,0,0,0,0,0,0,0,0,0,0,0,0,0,0,0,0,0,0,0,0,0,0,0,0,0,0,0,0,0,0,0,0,0,0,0,0,0,0,0,0,0,0,0,2.4900000000000002,2.52,2.58,2.65,2.71,2.77,2.83,2.89,2.97,3.04,3.26,3.32,3.42,3.47,3.57,3.62,3.73,4.04,4.04,4.04,4.49,4.49,4.49,4.6500000000000004,4.6500000000000004,4.96,4.96,5.17,5.27,5.38,5.43,5.43,5.43,5.43,5.43,5.58,5.58,5.58,5.58,5.58,5.58,5.58,5.58,5.58,5.68,5.68,5.68,5.68,5.68,5.68,5.68,5.68,5.68,5.68,5.68,5.68]
[42,0,0,0,0,0,0,0,0,0,0,0,0,0,0,0,0,0,0,0,0,0,0,0,0,0,0,0,0,0,0,0,0,0,0,0,0,0,0,0,0,0,0,0,0,0,0,0,0,2.52,2.5499999999999998,2.58,2.65,2.71,2.77,2.83,2.89,2.97,3.04,3.26,3.32,3.42,3.47,3.57,3.62,3.73,4.04,4.04,4.04,4.49,4.49,4.49,4.6500000000000004,4.6500000000000004,4.96,4.96,5.17,5.27,5.38,5.43,5.43,5.43,5.43,5.43,5.58,5.58,5.58,5.58,5.58,5.58,5.58,5.58,5.58,5.68,5.68,5.68,5.68,5.68,5.68,5.68,5.68,5.68,5.68,5.68,5.68]
[43,0,0,0,0,0,0,0,0,0,0,0,0,0,0,0,0,0,0,0,0,0,0,0,0,0,0,0,0,0,0,0,0,0,0,0,0,0,0,0,0,0,0,0,0,0,0,0,0,2.57,2.58,2.62,2.65,2.71,2.77,2.83,2.89,2.97,3.04,3.26,3.32,3.42,3.47,3.57,3.62,3.73,4.04,4.04,4.04,4.49,4.49,4.49,4.6500000000000004,4.6500000000000004,4.96,4.96,5.17,5.27,5.38,5.43,5.43,5.43,5.43,5.43,5.58,5.58,5.58,5.58,5.58,5.58,5.58,5.58,5.58,5.68,5.68,5.68,5.68,5.68,5.68,5.68,5.68,5.68,5.68,5.68,5.68]
[44,0,0,0,0,0,0,0,0,0,0,0,0,0,0,0,0,0,0,0,0,0,0,0,0,0,0,0,0,0,0,0,0,0,0,0,0,0,0,0,0,0,0,0,0,0,0,0,0,2.61,2.63,2.65,2.68,2.71,2.77,2.83,2.89,2.97,3.04,3.26,3.32,3.42,3.47,3.57,3.62,3.73,4.04,4.04,4.04,4.49,4.49,4.49,4.6500000000000004,4.6500000000000004,4.96,4.96,5.17,5.27,5.38,5.43,5.43,5.43,5.43,5.43,5.58,5.58,5.58,5.58,5.58,5.58,5.58,5.58,5.58,5.68,5.68,5.68,5.68,5.68,5.68,5.68,5.68,5.68,5.68,5.68,5.68]
[45,0,0,0,0,0,0,0,0,0,0,0,0,0,0,0,0,0,0,0,0,0,0,0,0,0,0,0,0,0,0,0,0,0,0,0,0,0,0,0,0,0,0,0,0,0,0,0,0,2.64,2.66,2.68,2.71,2.74,2.77,2.83,2.89,2.97,3.04,3.26,3.32,3.42,3.47,3.57,3.62,3.73,4.04,4.04,4.04,4.49,4.49,4.49,4.6500000000000004,4.6500000000000004,4.96,4.96,5.17,5.27,5.38,5.43,5.43,5.43,5.43,5.43,5.58,5.58,5.58,5.58,5.58,5.58,5.58,5.58,5.58,5.68,5.68,5.68,5.68,5.68,5.68,5.68,5.68,5.68,5.68,5.68,5.68]
[46,0,0,0,0,0,0,0,0,0,0,0,0,0,0,0,0,0,0,0,0,0,0,0,0,0,0,0,0,0,0,0,0,0,0,0,0,0,0,0,0,0,0,0,0,0,0,0,0,2.68,2.69,2.71,2.73,2.77,2.8,2.83,2.89,2.97,3.04,3.26,3.32,3.42,3.47,3.57,3.62,3.73,4.04,4.04,4.04,4.49,4.49,4.49,4.6500000000000004,4.6500000000000004,4.96,4.96,5.17,5.27,5.38,5.43,5.43,5.43,5.43,5.43,5.58,5.58,5.58,5.58,5.58,5.58,5.58,5.58,5.58,5.68,5.68,5.68,5.68,5.68,5.68,5.68,5.68,5.68,5.68,5.68,5.68]
[47,0,0,0,0,0,0,0,0,0,0,0,0,0,0,0,0,0,0,0,0,0,0,0,0,0,0,0,0,0,0,0,0,0,0,0,0,0,0,0,0,0,0,0,0,0,0,0,0,2.71,2.72,2.74,2.76,2.79,2.82,2.86,2.89,2.97,3.04,3.26,3.32,3.42,3.47,3.57,3.62,3.73,4.04,4.04,4.04,4.49,4.49,4.49,4.6500000000000004,4.6500000000000004,4.96,4.96,5.17,5.27,5.38,5.43,5.43,5.43,5.43,5.43,5.58,5.58,5.58,5.58,5.58,5.58,5.58,5.58,5.58,5.68,5.68,5.68,5.68,5.68,5.68,5.68,5.68,5.68,5.68,5.68,5.68]
[48,0,0,0,0,0,0,0,0,0,0,0,0,0,0,0,0,0,0,0,0,0,0,0,0,0,0,0,0,0,0,0,0,0,0,0,0,0,0,0,0,0,0,0,0,0,0,0,0,2.75,3.04,2.77,2.79,2.81,2.84,2.88,2.92,2.97,3.04,3.26,3.32,3.42,3.47,3.57,3.62,3.73,4.04,4.04,4.04,4.49,4.49,4.49,4.6500000000000004,4.6500000000000004,4.96,4.96,5.17,5.27,5.38,5.43,5.43,5.43,5.43,5.43,5.58,5.58,5.58,5.58,5.58,5.58,5.58,5.58,5.58,5.68,5.68,5.68,5.68,5.68,5.68,5.68,5.68,5.68,5.68,5.68,5.68]
[49,0,0,0,0,0,0,0,0,0,0,0,0,0,0,0,0,0,0,0,0,0,0,0,0,0,0,0,0,0,0,0,0,0,0,0,0,0,0,0,0,0,0,0,0,0,0,0,0,2.77,2.78,3.03,2.82,2.84,2.87,2.9,2.95,2.99,3.04,3.26,3.32,3.42,3.47,3.57,3.62,3.73,4.04,4.04,4.04,4.49,4.49,4.49,4.6500000000000004,4.6500000000000004,4.96,4.96,5.17,5.27,5.38,5.43,5.43,5.43,5.43,5.43,5.58,5.58,5.58,5.58,5.58,5.58,5.58,5.58,5.58,5.68,5.68,5.68,5.68,5.68,5.68,5.68,5.68,5.68,5.68,5.68,5.68]
[50,0,0,0,0,0,0,0,0,0,0,0,0,0,0,0,0,0,0,0,0,0,0,0,0,0,0,0,0,0,0,0,0,0,0,0,0,0,0,0,0,0,0,0,0,0,0,0,0,2.82,2.82,2.83,3.07,2.87,2.89,2.92,2.96,3.01,3.06,3.26,3.32,3.42,3.47,3.57,3.62,3.73,4.04,4.04,4.04,4.49,4.49,4.49,4.6500000000000004,4.6500000000000004,4.96,4.96,5.17,5.27,5.38,5.43,5.43,5.43,5.43,5.43,5.58,5.58,5.58,5.58,5.58,5.58,5.58,5.58,5.58,5.68,5.68,5.68,5.68,5.68,5.68,5.68,5.68,5.68,5.68,5.68,5.68]
[51,0,0,0,0,0,0,0,0,0,0,0,0,0,0,0,0,0,0,0,0,0,0,0,0,0,0,0,0,0,0,0,0,0,0,0,0,0,0,0,0,0,0,0,0,0,0,0,0,0,2.87,2.87,2.88,3.12,2.92,2.93,2.98,3.02,3.07,3.26,3.32,3.42,3.47,3.57,3.62,3.73,4.04,4.04,4.04,4.49,4.49,4.49,4.6500000000000004,4.6500000000000004,4.96,4.96,5.17,5.27,5.38,5.43,5.43,5.43,5.43,5.43,5.58,5.58,5.58,5.58,5.58,5.58,5.58,5.58,5.58,5.68,5.68,5.68,5.68,5.68,5.68,5.68,5.68,5.68,5.68,5.68,5.68]
[52,0,0,0,0,0,0,0,0,0,0,0,0,0,0,0,0,0,0,0,0,0,0,0,0,0,0,0,0,0,0,0,0,0,0,0,0,0,0,0,0,0,0,0,0,0,0,0,0,0,0,2.92,2.92,2.93,3.18,2.98,2.99,3.03,3.08,3.26,3.55,3.58,3.58,3.58,3.62,3.73,4.04,4.04,4.04,4.49,4.49,4.49,4.6500000000000004,4.6500000000000004,4.96,4.96,5.17,5.27,5.38,5.43,5.43,5.43,5.43,5.43,5.58,5.58,5.58,5.58,5.58,5.58,5.58,5.58,5.58,5.68,5.68,5.68,5.68,5.68,5.68,5.68,5.68,5.68,5.68,5.68,5.68]
[53,0,0,0,0,0,0,0,0,0,0,0,0,0,0,0,0,0,0,0,0,0,0,0,0,0,0,0,0,0,0,0,0,0,0,0,0,0,0,0,0,0,0,0,0,0,0,0,0,0,0,0,2.98,2.98,2.99,3.22,3.03,3.04,3.09,3.26,3.32,3.55,3.58,3.58,3.62,3.73,4.04,4.04,4.04,4.49,4.49,4.49,4.6500000000000004,4.6500000000000004,4.96,4.96,5.17,5.27,5.38,5.43,5.43,5.43,5.43,5.43,5.58,5.58,5.58,5.58,5.58,5.58,5.58,5.58,5.58,5.68,5.68,5.68,5.68,5.68,5.68,5.68,5.68,5.68,5.68,5.68,5.68]
[54,0,0,0,0,0,0,0,0,0,0,0,0,0,0,0,0,0,0,0,0,0,0,0,0,0,0,0,0,0,0,0,0,0,0,0,0,0,0,0,0,0,0,0,0,0,0,0,0,0,0,0,0,3.07,3.07,3.07,3.29,3.09,3.11,3.21,3.32,3.53,3.55,3.57,3.62,3.73,4.04,4.04,4.04,4.49,4.49,4.49,4.6500000000000004,4.6500000000000004,4.96,4.96,5.17,5.27,5.38,5.43,5.43,5.43,5.43,5.43,5.58,5.58,5.58,5.58,5.58,5.58,5.58,5.58,5.58,5.68,5.68,5.68,5.68,5.68,5.68,5.68,5.68,5.68,5.68,5.68,5.68]
[55,0,0,0,0,0,0,0,0,0,0,0,0,0,0,0,0,0,0,0,0,0,0,0,0,0,0,0,0,0,0,0,0,0,0,0,0,0,0,0,0,0,0,0,0,0,0,0,0,0,0,0,0,0,3.11,3.11,3.12,3.33,3.16,3.21,3.26,3.56,3.53,3.55,3.62,3.73,4.04,4.04,4.04,4.49,4.49,4.49,4.6500000000000004,4.6500000000000004,4.96,4.96,5.17,5.27,5.38,5.43,5.43,5.43,5.43,5.43,5.58,5.58,5.58,5.58,5.58,5.58,5.58,5.58,5.58,5.68,5.68,5.68,5.68,5.68,5.68,5.68,5.68,5.68,5.68,5.68,5.68]
[56,0,0,0,0,0,0,0,0,0,0,0,0,0,0,0,0,0,0,0,0,0,0,0,0,0,0,0,0,0,0,0,0,0,0,0,0,0,0,0,0,0,0,0,0,0,0,0,0,0,0,0,0,0,0,3.13,3.14,3.16,3.37,3.89,3.53,3.42,3.47,3.53,4,3.89,4.04,4.04,4.04,4.49,4.49,4.49,4.6500000000000004,4.6500000000000004,4.96,4.96,5.17,5.27,5.38,5.43,5.43,5.43,5.43,5.43,5.58,5.58,5.58,5.58,5.58,5.58,5.58,5.58,5.58,5.68,5.68,5.68,5.68,5.68,5.68,5.68,5.68,5.68,5.68,5.68,5.68]
[57,0,0,0,0,0,0,0,0,0,0,0,0,0,0,0,0,0,0,0,0,0,0,0,0,0,0,0,0,0,0,0,0,0,0,0,0,0,0,0,0,0,0,0,0,0,0,0,0,0,0,0,0,0,0,0,3.45,3.55,3.77,4.1100000000000003,3.9,3.74,3.69,3.73,3.98,4,4.03,4.04,4.04,4.49,4.49,4.49,4.6500000000000004,4.6500000000000004,4.96,4.96,5.17,5.27,5.38,5.43,5.43,5.43,5.43,5.43,5.58,5.58,5.58,5.58,5.58,5.58,5.58,5.58,5.58,5.68,5.68,5.68,5.68,5.68,5.68,5.68,5.68,5.68,5.68,5.68,5.68]
[58,0,0,0,0,0,0,0,0,0,0,0,0,0,0,0,0,0,0,0,0,0,0,0,0,0,0,0,0,0,0,0,0,0,0,0,0,0,0,0,0,0,0,0,0,0,0,0,0,0,0,0,0,0,0,0,0,3.45,3.55,3.77,4.1100000000000003,3.9,3.76,3.78,3.98,3.98,4,4.03,4.04,4.49,4.49,4.49,4.6500000000000004,4.6500000000000004,4.96,4.96,5.17,5.27,5.38,5.43,5.43,5.43,5.43,5.43,5.58,5.58,5.58,5.58,5.58,5.58,5.58,5.58,5.58,5.68,5.68,5.68,5.68,5.68,5.68,5.68,5.68,5.68,5.68,5.68,5.68]
[59,0,0,0,0,0,0,0,0,0,0,0,0,0,0,0,0,0,0,0,0,0,0,0,0,0,0,0,0,0,0,0,0,0,0,0,0,0,0,0,0,0,0,0,0,0,0,0,0,0,0,0,0,0,0,0,0,0,3.45,3.55,3.77,4.1100000000000003,3.9,3.84,4.01,3.98,3.98,4,4.03,4.49,4.49,4.49,4.6500000000000004,4.6500000000000004,4.96,4.96,5.17,5.27,5.38,5.43,5.43,5.43,5.43,5.43,5.58,5.58,5.58,5.58,5.58,5.58,5.58,5.58,5.58,5.68,5.68,5.68,5.68,5.68,5.68,5.68,5.68,5.68,5.68,5.68,5.68]
[60,0,0,0,0,0,0,0,0,0,0,0,0,0,0,0,0,0,0,0,0,0,0,0,0,0,0,0,0,0,0,0,0,0,0,0,0,0,0,0,0,0,0,0,0,0,0,0,0,0,0,0,0,0,0,0,0,0,0,3.45,3.55,3.77,4.1100000000000003,4.04,4.0599999999999996,4.01,3.99,3.98,4,4.4800000000000004,4.4800000000000004,4.4800000000000004,4.6500000000000004,4.6500000000000004,4.96,4.96,5.17,5.27,5.38,5.43,5.43,5.43,5.43,5.43,5.58,5.58,5.58,5.58,5.58,5.58,5.58,5.58,5.58,5.68,5.68,5.68,5.68,5.68,5.68,5.68,5.68,5.68,5.68,5.68,5.68]
[61,0,0,0,0,0,0,0,0,0,0,0,0,0,0,0,0,0,0,0,0,0,0,0,0,0,0,0,0,0,0,0,0,0,0,0,0,0,0,0,0,0,0,0,0,0,0,0,0,0,0,0,0,0,0,0,0,0,0,0,3.45,3.55,3.77,4.1100000000000003,4.22,4.0599999999999996,4.04,4.04,3.98,4.45,4.4800000000000004,4.4800000000000004,4.4800000000000004,4.6500000000000004,4.96,4.96,5.17,5.27,5.38,5.43,5.43,5.43,5.43,5.43,5.58,5.58,5.58,5.58,5.58,5.58,5.58,5.58,5.58,5.68,5.68,5.68,5.68,5.68,5.68,5.68,5.68,5.68,5.68,5.68,5.68]
[62,0,0,0,0,0,0,0,0,0,0,0,0,0,0,0,0,0,0,0,0,0,0,0,0,0,0,0,0,0,0,0,0,0,0,0,0,0,0,0,0,0,0,0,0,0,0,0,0,0,0,0,0,0,0,0,0,0,0,0,0,3.71,3.81,4.04,4.49,4.2300000000000004,4.1100000000000003,4.07,4.03,4.43,4.45,4.4800000000000004,4.6100000000000003,4.6100000000000003,4.96,4.96,5.17,5.27,5.38,5.43,5.43,5.43,5.43,5.43,5.58,5.58,5.58,5.58,5.58,5.58,5.58,5.58,5.58,5.68,5.68,5.68,5.68,5.68,5.68,5.68,5.68,5.68,5.68,5.68,5.68]
[63,0,0,0,0,0,0,0,0,0,0,0,0,0,0,0,0,0,0,0,0,0,0,0,0,0,0,0,0,0,0,0,0,0,0,0,0,0,0,0,0,0,0,0,0,0,0,0,0,0,0,0,0,0,0,0,0,0,0,0,0,0,3.71,3.81,4.04,4.49,4.33,4.1100000000000003,4.05,4.43,4.43,4.45,4.4800000000000004,4.6100000000000003,4.6100000000000003,4.96,5.17,5.27,5.38,5.43,5.43,5.43,5.43,5.43,5.58,5.58,5.58,5.58,5.58,5.58,5.58,5.58,5.58,5.68,5.68,5.68,5.68,5.68,5.68,5.68,5.68,5.68,5.68,5.68,5.68]
[64,0,0,0,0,0,0,0,0,0,0,0,0,0,0,0,0,0,0,0,0,0,0,0,0,0,0,0,0,0,0,0,0,0,0,0,0,0,0,0,0,0,0,0,0,0,0,0,0,0,0,0,0,0,0,0,0,0,0,0,0,0,0,3.71,3.81,4.04,4.49,4.43,4.16,4.46,4.43,4.43,4.45,4.4800000000000004,4.76,4.76,5.17,5.27,5.38,5.43,5.43,5.43,5.43,5.43,5.58,5.58,5.58,5.58,5.58,5.58,5.58,5.58,5.58,5.68,5.68,5.68,5.68,5.68,5.68,5.68,5.68,5.68,5.68,5.68,5.68]
[65,0,0,0,0,0,0,0,0,0,0,0,0,0,0,0,0,0,0,0,0,0,0,0,0,0,0,0,0,0,0,0,0,0,0,0,0,0,0,0,0,0,0,0,0,0,0,0,0,0,0,0,0,0,0,0,0,0,0,0,0,0,0,0,3.72,3.82,4.05,4.49,4.5199999999999996,4.51,4.46,4.43,4.43,4.4400000000000004,4.9400000000000004,4.9400000000000004,4.9400000000000004,5.27,5.38,5.43,5.43,5.43,5.43,5.43,5.58,5.58,5.58,5.58,5.58,5.58,5.58,5.58,5.58,5.68,5.68,5.68,5.68,5.68,5.68,5.68,5.68,5.68,5.68,5.68,5.68]
[66,0,0,0,0,0,0,0,0,0,0,0,0,0,0,0,0,0,0,0,0,0,0,0,0,0,0,0,0,0,0,0,0,0,0,0,0,0,0,0,0,0,0,0,0,0,0,0,0,0,0,0,0,0,0,0,0,0,0,0,0,0,0,0,0,4,4.08,4.24,4.53,4.6500000000000004,4.51,4.4800000000000004,4.5,4.43,4.8899999999999997,4.9400000000000004,5.08,5.0999999999999996,5.38,5.43,5.43,5.43,5.43,5.43,5.58,5.58,5.58,5.58,5.58,5.58,5.58,5.58,5.58,5.68,5.68,5.68,5.68,5.68,5.68,5.68,5.68,5.68,5.68,5.68,5.68]
[67,0,0,0,0,0,0,0,0,0,0,0,0,0,0,0,0,0,0,0,0,0,0,0,0,0,0,0,0,0,0,0,0,0,0,0,0,0,0,0,0,0,0,0,0,0,0,0,0,0,0,0,0,0,0,0,0,0,0,0,0,0,0,0,0,0,4.08,4.1900000000000004,4.4400000000000004,4.9400000000000004,4.72,4.55,4.5199999999999996,4.49,4.87,4.8899999999999997,4.9400000000000004,5.08,5.3,5.43,5.43,5.43,5.43,5.43,5.58,5.58,5.58,5.58,5.58,5.58,5.58,5.58,5.58,5.68,5.68,5.68,5.68,5.68,5.68,5.68,5.68,5.68,5.68,5.68,5.68]
[{"$f":"A67+1","v":68},0,0,0,0,0,0,0,0,0,0,0,0,0,0,0,0,0,0,0,0,0,0,0,0,0,0,0,0,0,0,0,0,0,0,0,0,0,0,0,0,0,0,0,0,0,0,0,0,0,0,0,0,0,0,0,0,0,0,0,0,0,0,0,0,0,0,4.08,4.1900000000000004,4.4400000000000004,4.9400000000000004,4.8099999999999996,4.58,4.51,4.88,4.87,4.8899999999999997,4.9400000000000004,5.08,5.0999999999999996,5.43,5.43,5.43,5.43,5.58,5.58,5.58,5.58,5.58,5.58,5.58,5.58,5.58,5.68,5.68,5.68,5.68,5.68,5.68,5.68,5.68,5.68,5.68,5.68,5.68]
[{"$f":"A68+1","v":69},0,0,0,0,0,0,0,0,0,0,0,0,0,0,0,0,0,0,0,0,0,0,0,0,0,0,0,0,0,0,0,0,0,0,0,0,0,0,0,0,0,0,0,0,0,0,0,0,0,0,0,0,0,0,0,0,0,0,0,0,0,0,0,0,0,0,0,4.08,4.1900000000000004,4.4400000000000004,4.9400000000000004,4.91,4.6100000000000003,4.91,4.88,4.87,4.8899999999999997,4.9400000000000004,5.23,5.23,5.43,5.43,5.43,5.58,5.58,5.58,5.58,5.58,5.58,5.58,5.58,5.58,5.68,5.68,5.68,5.68,5.68,5.68,5.68,5.68,5.68,5.68,5.68,5.68]
[70,0,0,0,0,0,0,0,0,0,0,0,0,0,0,0,0,0,0,0,0,0,0,0,0,0,0,0,0,0,0,0,0,0,0,0,0,0,0,0,0,0,0,0,0,0,0,0,0,0,0,0,0,0,0,0,0,0,0,0,0,0,0,0,0,0,0,0,0,4.09,4.2,4.45,4.97,5.01,4.97,4.91,4.88,4.87,4.8899999999999997,5.39,5.39,5.39,5.43,5.43,5.58,5.58,5.58,5.58,5.58,5.58,5.58,5.58,5.58,5.68,5.68,5.68,5.68,5.68,5.68,5.68,5.68,5.68,5.68,5.68,5.68]
[71,0,0,0,0,0,0,0,0,0,0,0,0,0,0,0,0,0,0,0,0,0,0,0,0,0,0,0,0,0,0,0,0,0,0,0,0,0,0,0,0,0,0,0,0,0,0,0,0,0,0,0,0,0,0,0,0,0,0,0,0,0,0,0,0,0,0,0,0,0,4.37,4.46,4.6500000000000004,5.07,5.0999999999999996,4.97,4.92,4.9400000000000004,4.91,5.34,5.39,5.39,5.39,5.43,5.58,5.58,5.58,5.58,5.58,5.58,5.58,5.58,5.58,5.68,5.68,5.68,5.68,5.68,5.68,5.68,5.68,5.68,5.68,5.68,5.68]
[72,0,0,0,0,0,0,0,0,0,0,0,0,0,0,0,0,0,0,0,0,0,0,0,0,0,0,0,0,0,0,0,0,0,0,0,0,0,0,0,0,0,0,0,0,0,0,0,0,0,0,0,0,0,0,0,0,0,0,0,0,0,0,0,0,0,0,0,0,0,0,4.47,4.59,4.8600000000000003,5.4,5.2,5.0199999999999996,4.96,4.9400000000000004,5.32,5.34,5.39,5.39,5.39,5.58,5.58,5.58,5.58,5.58,5.58,5.58,5.58,5.58,5.68,5.68,5.68,5.68,5.68,5.68,5.68,5.68,5.68,5.68,5.68,5.68]
[73,0,0,0,0,0,0,0,0,0,0,0,0,0,0,0,0,0,0,0,0,0,0,0,0,0,0,0,0,0,0,0,0,0,0,0,0,0,0,0,0,0,0,0,0,0,0,0,0,0,0,0,0,0,0,0,0,0,0,0,0,0,0,0,0,0,0,0,0,0,0,0,4.47,4.59,4.8600000000000003,5.4,5.3,5.16,4.93,5.33,5.32,5.34,5.39,5.39,5.39,5.58,5.58,5.58,5.58,5.58,5.58,5.58,5.58,5.68,5.68,5.68,5.68,5.68,5.68,5.68,5.68,5.68,5.68,5.68,5.68]
[74,0,0,0,0,0,0,0,0,0,0,0,0,0,0,0,0,0,0,0,0,0,0,0,0,0,0,0,0,0,0,0,0,0,0,0,0,0,0,0,0,0,0,0,0,0,0,0,0,0,0,0,0,0,0,0,0,0,0,0,0,0,0,0,0,0,0,0,0,0,0,0,0,4.47,4.59,4.8600000000000003,5.45,5.39,5.3,5.36,5.33,5.36,5.34,5.39,5.4,5.4,5.58,5.58,5.58,5.58,5.58,5.58,5.58,5.68,5.68,5.68,5.68,5.68,5.68,5.68,5.68,5.68,5.68,5.68,5.68]
[75,0,0,0,0,0,0,0,0,0,0,0,0,0,0,0,0,0,0,0,0,0,0,0,0,0,0,0,0,0,0,0,0,0,0,0,0,0,0,0,0,0,0,0,0,0,0,0,0,0,0,0,0,0,0,0,0,0,0,0,0,0,0,0,0,0,0,0,0,0,0,0,0,0,4.57,4.7,4.96,5.48,5.49,5.43,5.36,5.33,5.39,5.35,5.67,5.67,5.6,5.58,5.58,5.58,5.58,5.58,5.58,5.68,5.68,5.68,5.68,5.68,5.68,5.68,5.68,5.68,5.68,5.68,5.68]
[76,0,0,0,0,0,0,0,0,0,0,0,0,0,0,0,0,0,0,0,0,0,0,0,0,0,0,0,0,0,0,0,0,0,0,0,0,0,0,0,0,0,0,0,0,0,0,0,0,0,0,0,0,0,0,0,0,0,0,0,0,0,0,0,0,0,0,0,0,0,0,0,0,0,0,4.6500000000000004,4.79,5.07,5.51,5.59,5.43,5.36,5.37,5.41,5.38,5.39,5.43,5.43,5.58,5.58,5.58,5.58,5.58,5.68,5.68,5.68,5.68,5.68,5.68,5.68,5.68,5.68,5.68,5.68,5.68]
[77,0,0,0,0,0,0,0,0,0,0,0,0,0,0,0,0,0,0,0,0,0,0,0,0,0,0,0,0,0,0,0,0,0,0,0,0,0,0,0,0,0,0,0,0,0,0,0,0,0,0,0,0,0,0,0,0,0,0,0,0,0,0,0,0,0,0,0,0,0,0,0,0,0,0,0,4.92,5.0599999999999996,5.35,5.9,5.68,5.44,5.43,5.41,5.41,5.41,5.39,5.43,5.43,5.58,5.58,5.58,5.58,5.68,5.68,5.68,5.68,5.68,5.68,5.68,5.68,5.68,5.68,5.68,5.68]
[78,0,0,0,0,0,0,0,0,0,0,0,0,0,0,0,0,0,0,0,0,0,0,0,0,0,0,0,0,0,0,0,0,0,0,0,0,0,0,0,0,0,0,0,0,0,0,0,0,0,0,0,0,0,0,0,0,0,0,0,0,0,0,0,0,0,0,0,0,0,0,0,0,0,0,0,0,4.92,5.0599999999999996,5.35,5.9,5.78,5.51,5.43,5.44,5.41,5.43,5.41,5.43,5.43,5.58,5.58,5.58,5.68,5.68,5.68,5.68,5.68,5.68,5.68,5.68,5.68,5.68,5.68,5.68]
[79,0,0,0,0,0,0,0,0,0,0,0,0,0,0,0,0,0,0,0,0,0,0,0,0,0,0,0,0,0,0,0,0,0,0,0,0,0,0,0,0,0,0,0,0,0,0,0,0,0,0,0,0,0,0,0,0,0,0,0,0,0,0,0,0,0,0,0,0,0,0,0,0,0,0,0,0,0,4.92,5.0599999999999996,5.35,6.05,5.88,5.52,5.49,5.44,5.32,5.35,5.39,5.43,5.43,5.58,5.58,5.68,5.68,5.68,5.68,5.68,5.68,5.68,5.68,5.68,5.68,5.68,5.68]
[80,0,0,0,0,0,0,0,0,0,0,0,0,0,0,0,0,0,0,0,0,0,0,0,0,0,0,0,0,0,0,0,0,0,0,0,0,0,0,0,0,0,0,0,0,0,0,0,0,0,0,0,0,0,0,0,0,0,0,0,0,0,0,0,0,0,0,0,0,0,0,0,0,0,0,0,0,0,0,4.92,5.0599999999999996,5.35,6.05,5.68,5.71,5.49,5.43,5.38,5.35,5.68,5.68,5.63,5.68,5.68,5.68,5.68,5.68,5.68,5.68,5.68,5.68,5.68,5.68,5.68,5.68]
[81,0,0,0,0,0,0,0,0,0,0,0,0,0,0,0,0,0,0,0,0,0,0,0,0,0,0,0,0,0,0,0,0,0,0,0,0,0,0,0,0,0,0,0,0,0,0,0,0,0,0,0,0,0,0,0,0,0,0,0,0,0,0,0,0,0,0,0,0,0,0,0,0,0,0,0,0,0,0,0,4.92,5.0599999999999996,5.35,6.05,5.72,5.74,5.79,5.75,5.43,5.27,5.15,5.3,5.46,5.63,5.68,5.68,5.68,5.68,5.68,5.68,5.68,5.68,5.68,5.68,5.68]
[82,0,0,0,0,0,0,0,0,0,0,0,0,0,0,0,0,0,0,0,0,0,0,0,0,0,0,0,0,0,0,0,0,0,0,0,0,0,0,0,0,0,0,0,0,0,0,0,0,0,0,0,0,0,0,0,0,0,0,0,0,0,0,0,0,0,0,0,0,0,0,0,0,0,0,0,0,0,0,0,0,4.92,5.0599999999999996,5.35,5.99,5.78,5.81,5.88,5.86,5.54,5.27,5.15,5.31,5.46,5.63,5.68,5.68,5.68,5.68,5.68,5.68,5.68,5.68,5.68,5.68]
[83,0,0,0,0,0,0,0,0,0,0,0,0,0,0,0,0,0,0,0,0,0,0,0,0,0,0,0,0,0,0,0,0,0,0,0,0,0,0,0,0,0,0,0,0,0,0,0,0,0,0,0,0,0,0,0,0,0,0,0,0,0,0,0,0,0,0,0,0,0,0,0,0,0,0,0,0,0,0,0,0,0,5.03,5.17,5.47,6.13,5.85,5.91,5.97,5.96,5.54,5.27,5.15,5.31,5.46,5.63,5.68,5.68,5.68,5.68,5.68,5.68,5.68,5.68,5.68]
[84,0,0,0,0,0,0,0,0,0,0,0,0,0,0,0,0,0,0,0,0,0,0,0,0,0,0,0,0,0,0,0,0,0,0,0,0,0,0,0,0,0,0,0,0,0,0,0,0,0,0,0,0,0,0,0,0,0,0,0,0,0,0,0,0,0,0,0,0,0,0,0,0,0,0,0,0,0,0,0,0,0,0,5.12,5.26,5.57,6.3,5.96,6.02,6.05,5.96,5.54,5.27,5.15,5.31,5.46,5.63,5.68,5.68,5.68,5.68,5.68,5.68,5.68,5.68]
[85,0,0,0,0,0,0,0,0,0,0,0,0,0,0,0,0,0,0,0,0,0,0,0,0,0,0,0,0,0,0,0,0,0,0,0,0,0,0,0,0,0,0,0,0,0,0,0,0,0,0,0,0,0,0,0,0,0,0,0,0,0,0,0,0,0,0,0,0,0,0,0,0,0,0,0,0,0,0,0,0,0,0,0,5.22,5.37,5.67,6.35,6.12,6.13,6.05,5.96,5.54,5.27,5.15,5.31,5.46,5.63,5.68,5.68,5.68,5.68,5.68,5.68,5.68]

{"sheet":"PIA","index":13,"n_rows":22,"n_cols":6,"rows_kept":22,"cut":false,"hidden":true,"merged":[[0,1,0,3],[0,4,0,5]]}
["PIA Info","Today",null,null,"Tomorrow"]
[0,0.3,0,{"$f":"Premium*(1+PIA!B2)","v":130000},{"$f":"Premium*'Income Table'!F56","v":3000},{"$f":"Premium","v":100000}]
[1,0.375,0,{"$f":"Premium*(1+PIA!B3)","v":137500},null,{"$f":"F2+$E$2","v":103000}]
[2,0.45,0,{"$f":"Premium*(1+PIA!B4)","v":145000},null,{"$f":"F3+$E$2","v":106000}]
[3,0.45,{"$f":"$D$2*0.03","v":3900},{"$f":"D4+C5","v":148900},null,109000]
[{"$f":"A5+1","v":4},0.45,{"$f":"$D$2*0.03","v":3900},{"$f":"D5+C6","v":152800},null,112000]
[{"$f":"A6+1","v":5},0.45,3900,156700,null,115000]
[6,0.45,3900,160600,null,118000]
[7,0.45,3900,164500,null,121000]
[8,0.45,3900,168400,null,124000]
[9,0.45,3900,172300,null,127000]
[10,0.45,3900,176200,null,130000]
[11,0.45,3900,180100,{"$f":"Premium*'Income Table'!G56","v":0},{"$f":"F12+$E$13","v":130000}]
[12,0.45,3900,184000,null,{"$f":"F13+$E$13","v":130000}]
[13,0.45,3900,187900,null,130000]
[14,0.45,3900,191800,null,130000]
[15,0.45,3900,195700,null,130000]
[16,0.45,3900,199600,null,130000]
[17,0.45,3900,203500,null,130000]
[18,0.45,3900,207400,null,130000]
[19,0.45,3900,211300,null,130000]
[20,0.45,3900,215200,null,130000]